PDA

View Full Version : [FIXED] NullPointerException in 3.0.0.230



olegtaranenko
26 Oct 2012, 2:52 AM
try to build project in 3.0.0.230
got exception

3.0.0.201 builds like a charm...

Thoughts?

cheers, Oleg



Sencha Cmd v3.0.0.230[INFO ]
[INFO ] testing:
[INFO ]
[INFO ]
[INFO ] -before-init-local:
[INFO ]
[INFO ]
[INFO ] -init-local:
[INFO ]
[INFO ]
[INFO ] -after-init-local:
[INFO ]
[INFO ]
[INFO ] init-local:
[INFO ]
[INFO ]
[INFO ] find-cmd:
[INFO ]
[INFO ]
[INFO ] -before-init:
[INFO ]
[INFO ]
[INFO ] -init:
[INFO ]
[DEBUG] Initialize Sencha Cmd with prefix = ''
[DEBUG] found sencha.cfg at C:\Dokumente und Einstellungen\otaranenko\bin\Sencha\Cmd\3.0.0.230
[DEBUG] found workspace at C:\dev\odesk\pipedrive\git\Pipedrive-Mobile-App\Pipedrive\.sencha\workspace
[DEBUG] found app at C:\dev\odesk\pipedrive\git\Pipedrive-Mobile-App\Pipedrive\.sencha\app
[DEBUG] loading framework config from C:\dev\odesk\pipedrive\git\Pipedrive-Mobile-App\Pipedrive/touch
[DEBUG] found cmd at C:\dev\odesk\pipedrive\git\Pipedrive-Mobile-App\Pipedrive\touch\cmd
[DEBUG] Checking for framework config overrides
[DEBUG] resolving framework config overrides for 'touch'
[DEBUG] Detected framework version 2.1.0.394
[DEBUG] detected framework override at 'C:\Dokumente und Einstellungen\otaranenko\bin\Sencha\Cmd\3.0.0.230\plugins\touch\current'
[DEBUG] using framework config override 'C:\Dokumente und Einstellungen\otaranenko\bin\Sencha\Cmd\3.0.0.230\plugins\touch\current'
[DEBUG] adding C:\Dokumente und Einstellungen\otaranenko\bin\Sencha\Cmd\3.0.0.230/sencha.jar to classpath
[INFO ]
[INFO ] -after-init:
[INFO ]
[INFO ]
[INFO ] init:
[INFO ]
[INFO ]
[INFO ] -before-build:
[INFO ]
[INFO ]
[INFO ] sass:
[INFO ]
[INFO ]
[INFO ] -before-sass:
[INFO ]
[INFO ]
[INFO ] -sass:
[INFO ]
[INFO ] [shellscript]
[INFO ]
[INFO ] [shellscript] C:\dev\odesk\pipedrive\git\Pipedrive-Mobile-App\Pipedrive\resources\sass>compass compile --boring --force
[INFO ]
[INFO ] [shellscript] identical ../css/app.css
[INFO ]
[INFO ]
[INFO ] -after-sass:
[INFO ]
[INFO ]
[INFO ] page:
[INFO ]
[INFO ]
[INFO ] -before-page:
[INFO ]
[INFO ]
[INFO ] -page:
[INFO ]
[INFO ] building application
[INFO ] Deploying your application to C:\dev\odesk\pipedrive\git\Pipedrive-Mobile-App\Pipedrive\build\Pipedrive\testing
[DEBUG] copying all assets
[DEBUG] copying file C:\dev\odesk\pipedrive\git\Pipedrive-Mobile-App\Pipedrive\js\date.js
[INFO ] Copied js/date.js
[DEBUG] copying file C:\dev\odesk\pipedrive\git\Pipedrive-Mobile-App\Pipedrive\bootstrap.js
[INFO ] Copied bootstrap.js
[DEBUG] copying file C:\dev\odesk\pipedrive\git\Pipedrive-Mobile-App\Pipedrive\touch\sencha-touch.js
[INFO ] Copied touch/sencha-touch.js
[DEBUG] copying file C:\dev\odesk\pipedrive\git\Pipedrive-Mobile-App\Pipedrive\app.js
[INFO ] Copied app.js
[DEBUG] copying file C:\dev\odesk\pipedrive\git\Pipedrive-Mobile-App\Pipedrive\resources\css\app.css
[INFO ] Copied resources/css/app.css
[DEBUG] copying all extras
[DEBUG] copying from C:\dev\odesk\pipedrive\git\Pipedrive-Mobile-App\Pipedrive\resources\images to C:\dev\odesk\pipedrive\git\Pipedrive-Mobile-App\Pipedrive\build\Pipedrive\testing\resources\images
[INFO ] Copied C:\dev\odesk\pipedrive\git\Pipedrive-Mobile-App\Pipedrive\resources\images
[DEBUG] copying from C:\dev\odesk\pipedrive\git\Pipedrive-Mobile-App\Pipedrive\resources\icons to C:\dev\odesk\pipedrive\git\Pipedrive-Mobile-App\Pipedrive\build\Pipedrive\testing\resources\icons
[INFO ] Copied C:\dev\odesk\pipedrive\git\Pipedrive-Mobile-App\Pipedrive\resources\icons
[DEBUG] copying from C:\dev\odesk\pipedrive\git\Pipedrive-Mobile-App\Pipedrive\resources\loading to C:\dev\odesk\pipedrive\git\Pipedrive-Mobile-App\Pipedrive\build\Pipedrive\testing\resources\loading
[INFO ] Copied C:\dev\odesk\pipedrive\git\Pipedrive-Mobile-App\Pipedrive\resources\loading
[INFO ] Resolving your application dependencies (file:///C:/dev/odesk/pipedrive/git/Pipedrive-Mobile-App/Pipedrive/index.html)
[DEBUG] found sencha.cfg at C:\Dokumente und Einstellungen\otaranenko\bin\Sencha\Cmd\3.0.0.230
[DEBUG] found workspace at C:\dev\odesk\pipedrive\git\Pipedrive-Mobile-App\Pipedrive\.sencha\workspace
[DEBUG] found app at C:\dev\odesk\pipedrive\git\Pipedrive-Mobile-App\Pipedrive\.sencha\app
[DEBUG] loading framework config from C:\dev\odesk\pipedrive\git\Pipedrive-Mobile-App\Pipedrive/touch
[DEBUG] found cmd at C:\dev\odesk\pipedrive\git\Pipedrive-Mobile-App\Pipedrive\touch\cmd
[DEBUG] Checking for framework config overrides
[DEBUG] resolving framework config overrides for 'touch'
[DEBUG] Detected framework version 2.1.0.394
[DEBUG] detected framework override at 'C:\Dokumente und Einstellungen\otaranenko\bin\Sencha\Cmd\3.0.0.230\plugins\touch\current'
[DEBUG] using framework config override 'C:\Dokumente und Einstellungen\otaranenko\bin\Sencha\Cmd\3.0.0.230\plugins\touch\current'
[INFO ] Compiling app.js and dependencies
[DEBUG] running compiler with options : 'compile --ignore=src/locale,src/platform,auth2/Auth.js,scroller/Infinite.js --options=debug:false,logger:no,minVersion:3,product:touch union --recursive --file=app.js and concatenate -out=C:\dev\odesk\pipedrive\git\Pipedrive-Mobile-App\Pipedrive\build\Pipedrive\testing\app.js'
[DEBUG] found sencha.cfg at C:\Dokumente und Einstellungen\otaranenko\bin\Sencha\Cmd\3.0.0.230
[DEBUG] found workspace at C:\dev\odesk\pipedrive\git\Pipedrive-Mobile-App\Pipedrive\.sencha\workspace
[DEBUG] found app at C:\dev\odesk\pipedrive\git\Pipedrive-Mobile-App\Pipedrive\.sencha\app
[DEBUG] loading framework config from C:\dev\odesk\pipedrive\git\Pipedrive-Mobile-App\Pipedrive/touch
[DEBUG] found cmd at C:\dev\odesk\pipedrive\git\Pipedrive-Mobile-App\Pipedrive\touch\cmd
[DEBUG] Checking for framework config overrides
[DEBUG] resolving framework config overrides for 'touch'
[DEBUG] Detected framework version 2.1.0.394
[DEBUG] detected framework override at 'C:\Dokumente und Einstellungen\otaranenko\bin\Sencha\Cmd\3.0.0.230\plugins\touch\current'
[DEBUG] using framework config override 'C:\Dokumente und Einstellungen\otaranenko\bin\Sencha\Cmd\3.0.0.230\plugins\touch\current'
[DEBUG] Creating temporary directory C:\dev\odesk\pipedrive\git\Pipedrive-Mobile-App\Pipedrive\sencha-compile-temp-dir
[DEBUG] Adding filter src/locale to ignores
[DEBUG] Adding filter src/platform to ignores
[DEBUG] Adding filter auth2/Auth.js to ignores
[DEBUG] Adding filter scroller/Infinite.js to ignores
[DEBUG] setting parse options
[DEBUG] Adding class path ingores set : 4 elements
[DEBUG] loading class paths...
[INFO ] Processing classPath entry : C:\dev\odesk\pipedrive\git\Pipedrive-Mobile-App\Pipedrive\sencha-compile-temp-dir
[INFO ] Processing classPath entry : C:\dev\odesk\pipedrive\git\Pipedrive-Mobile-App\Pipedrive\touch\src
[INFO ] Processing classPath entry : C:\dev\odesk\pipedrive\git\Pipedrive-Mobile-App\Pipedrive\app.js
[INFO ] Processing classPath entry : C:\dev\odesk\pipedrive\git\Pipedrive-Mobile-App\Pipedrive\app
[DEBUG] default Touch application config detected
[DEBUG] adding implicit dependency for Ext.application call
[DEBUG] Creating virtual class definition Pipedrive.app.Application
[DEBUG] calculating dependency graph...
[DEBUG] Loading implicit dependencies file C:\Dokumente und Einstellungen\otaranenko\bin\Sencha\Cmd\3.0.0.230\plugins\touch\current\implicitClassDependencies.json
[DEBUG] Adding implicit dependency for Ext.Component
[DEBUG] Adding implicit dependency for Ext.container.AbstractContainer
[DEBUG] Adding implicit dependency for Ext.data.Model
[DEBUG] Adding implicit dependency for Ext.data.Model
[DEBUG] Adding implicit dependency for Ext.data.proxy.Proxy
[DEBUG] Adding implicit dependency for Ext.data.proxy.Proxy
[DEBUG] Adding implicit dependency for Ext.data.Store
[DEBUG] Adding implicit dependency for Ext.data.Store
[DEBUG] Adding implicit dependency for Ext.app.Profile
[DEBUG] Adding implicit dependency for Ext.app.Profile
[DEBUG] Adding implicit dependency for Ext.app.Profile
[DEBUG] Adding implicit dependency for Ext.app.Profile
[DEBUG] Adding implicit dependency for Ext.app.Controller
[DEBUG] Adding implicit dependency for Ext.app.Controller
[DEBUG] Adding implicit dependency for Ext.app.Controller
[DEBUG] Adding implicit dependency for Ext.app.Application
[DEBUG] Adding implicit dependency for Ext.app.Application
[DEBUG] Adding implicit dependency on Ext.data.Store for Pipedrive.data.RestApi to file C:\dev\odesk\pipedrive\git\Pipedrive-Mobile-App\Pipedrive\app\store\OrganizationLookup.js
[DEBUG] java.lang.NullPointerException
[DEBUG] removing tempdir C:\dev\odesk\pipedrive\git\Pipedrive-Mobile-App\Pipedrive\sencha-compile-temp-dir
[ERROR] The following error occurred while executing this line:
C:\dev\odesk\pipedrive\git\Pipedrive-Mobile-App\Pipedrive\.sencha\app\build-impl.xml:120: javax.script.ScriptException: sun.org.mozilla.javascript.internal.WrappedException: Wrapped com.sencha.exceptions.BasicException: java.lang.NullPointerException (<Unknown source>#461) in <Unknown source> at line number 461


com.sencha.exceptions.BasicException: The following error occurred while executing this line:
C:\dev\odesk\pipedrive\git\Pipedrive-Mobile-App\Pipedrive\.sencha\app\build-impl.xml:120: javax.script.ScriptException: sun.org.mozilla.javascript.internal.WrappedException: Wrapped com.sencha.exceptions.BasicException: java.lang.NullPointerException (<Unknown source>#461) in <Unknown source> at line number 461
at com.sencha.exceptions.BasicException.wrap(BasicException.java:43)
at com.sencha.cli.Command.dispatch(Command.java:104)
at com.sencha.cli.Commands.dispatch(Commands.java:49)
at com.sencha.cli.AbstractCommand.dispatch(AbstractCommand.java:184)
at com.sencha.command.Sencha.main(Sencha.java:58)
Caused by: C:\dev\odesk\pipedrive\git\Pipedrive-Mobile-App\Pipedrive\.sencha\app\build-impl.xml:126: The following error occurred while executing this line:
C:\dev\odesk\pipedrive\git\Pipedrive-Mobile-App\Pipedrive\.sencha\app\build-impl.xml:120: javax.script.ScriptException: sun.org.mozilla.javascript.internal.WrappedException: Wrapped com.sencha.exceptions.BasicException: java.lang.NullPointerException (<Unknown source>#461) in <Unknown source> at line number 461
at org.apache.tools.ant.ProjectHelper.addLocationToBuildException(ProjectHelper.java:551)
at org.apache.tools.ant.taskdefs.Ant.execute(Ant.java:444)
at org.apache.tools.ant.taskdefs.CallTarget.execute(CallTarget.java:105)
at org.apache.tools.ant.UnknownElement.execute(UnknownElement.java:291)
at sun.reflect.GeneratedMethodAccessor8.invoke(Unknown Source)
at sun.reflect.DelegatingMethodAccessorImpl.invoke(DelegatingMethodAccessorImpl.java:43)
at java.lang.reflect.Method.invoke(Method.java:601)
at org.apache.tools.ant.dispatch.DispatchUtils.execute(DispatchUtils.java:106)
at org.apache.tools.ant.Task.perform(Task.java:348)
at org.apache.tools.ant.Target.execute(Target.java:392)
at org.apache.tools.ant.Target.performTasks(Target.java:413)
at org.apache.tools.ant.Project.executeSortedTargets(Project.java:1399)
at org.apache.tools.ant.Project.executeTarget(Project.java:1368)
at org.apache.tools.ant.helper.DefaultExecutor.executeTargets(DefaultExecutor.java:41)
at org.apache.tools.ant.Project.executeTargets(Project.java:1251)
at com.sencha.ant.AntRunner.run(AntRunner.java:156)
at com.sencha.ant.AntRunner.run(AntRunner.java:80)
at com.sencha.command.ant.AntCommand.execute(AntCommand.java:74)
at sun.reflect.NativeMethodAccessorImpl.invoke0(Native Method)
at sun.reflect.NativeMethodAccessorImpl.invoke(NativeMethodAccessorImpl.java:57)
at sun.reflect.DelegatingMethodAccessorImpl.invoke(DelegatingMethodAccessorImpl.java:43)
at java.lang.reflect.Method.invoke(Method.java:601)
at com.sencha.cli.Command.dispatch(Command.java:78)
... 3 more
Caused by: C:\dev\odesk\pipedrive\git\Pipedrive-Mobile-App\Pipedrive\.sencha\app\build-impl.xml:120: javax.script.ScriptException: sun.org.mozilla.javascript.internal.WrappedException: Wrapped com.sencha.exceptions.BasicException: java.lang.NullPointerException (<Unknown source>#461) in <Unknown source> at line number 461
at org.apache.tools.ant.util.ReflectUtil.toBuildException(ReflectUtil.java:183)
at org.apache.tools.ant.util.ReflectUtil.throwBuildException(ReflectUtil.java:166)
at org.apache.tools.ant.util.ReflectUtil.invoke(ReflectUtil.java:110)
at org.apache.tools.ant.util.ReflectWrapper.invoke(ReflectWrapper.java:81)
at org.apache.tools.ant.util.optional.JavaxScriptRunner.evaluateScript(JavaxScriptRunner.java:103)
at org.apache.tools.ant.util.optional.JavaxScriptRunner.executeScript(JavaxScriptRunner.java:67)
at org.apache.tools.ant.taskdefs.optional.script.ScriptDef.executeScript(ScriptDef.java:350)
at org.apache.tools.ant.taskdefs.optional.script.ScriptDefBase.execute(ScriptDefBase.java:50)
at org.apache.tools.ant.UnknownElement.execute(UnknownElement.java:291)
at sun.reflect.GeneratedMethodAccessor8.invoke(Unknown Source)
at sun.reflect.DelegatingMethodAccessorImpl.invoke(DelegatingMethodAccessorImpl.java:43)
at java.lang.reflect.Method.invoke(Method.java:601)
at org.apache.tools.ant.dispatch.DispatchUtils.execute(DispatchUtils.java:106)
at org.apache.tools.ant.Task.perform(Task.java:348)
at org.apache.tools.ant.Target.execute(Target.java:392)
at org.apache.tools.ant.Target.performTasks(Target.java:413)
at org.apache.tools.ant.Project.executeSortedTargets(Project.java:1399)
at org.apache.tools.ant.helper.SingleCheckExecutor.executeTargets(SingleCheckExecutor.java:38)
at org.apache.tools.ant.Project.executeTargets(Project.java:1251)
at org.apache.tools.ant.taskdefs.Ant.execute(Ant.java:442)
... 24 more
Caused by: javax.script.ScriptException: sun.org.mozilla.javascript.internal.WrappedException: Wrapped com.sencha.exceptions.BasicException: java.lang.NullPointerException (<Unknown source>#461) in <Unknown source> at line number 461
at com.sun.script.javascript.RhinoScriptEngine.eval(RhinoScriptEngine.java:220)
at com.sun.script.javascript.RhinoScriptEngine.eval(RhinoScriptEngine.java:236)
at javax.script.AbstractScriptEngine.eval(AbstractScriptEngine.java:264)
at sun.reflect.NativeMethodAccessorImpl.invoke0(Native Method)
at sun.reflect.NativeMethodAccessorImpl.invoke(NativeMethodAccessorImpl.java:57)
at sun.reflect.DelegatingMethodAccessorImpl.invoke(DelegatingMethodAccessorImpl.java:43)
at java.lang.reflect.Method.invoke(Method.java:601)
at org.apache.tools.ant.util.ReflectUtil.invoke(ReflectUtil.java:108)
... 41 more
Caused by: sun.org.mozilla.javascript.internal.WrappedException: Wrapped com.sencha.exceptions.BasicException: java.lang.NullPointerException (<Unknown source>#461)
at sun.org.mozilla.javascript.internal.Context.throwAsScriptRuntimeEx(Context.java:1798)
at sun.org.mozilla.javascript.internal.MemberBox.invoke(MemberBox.java:198)
at sun.org.mozilla.javascript.internal.NativeJavaMethod.call(NativeJavaMethod.java:247)
at sun.org.mozilla.javascript.internal.Interpreter.interpretLoop(Interpreter.java:1711)
at sun.org.mozilla.javascript.internal.Interpreter.interpret(Interpreter.java:854)
at sun.org.mozilla.javascript.internal.InterpretedFunction.call(InterpretedFunction.java:164)
at sun.org.mozilla.javascript.internal.ContextFactory.doTopCall(ContextFactory.java:429)
at com.sun.script.javascript.RhinoScriptEngine$1.superDoTopCall(RhinoScriptEngine.java:116)
at com.sun.script.javascript.RhinoScriptEngine$1.doTopCall(RhinoScriptEngine.java:109)
at sun.org.mozilla.javascript.internal.ScriptRuntime.doTopCall(ScriptRuntime.java:3163)
at sun.org.mozilla.javascript.internal.InterpretedFunction.exec(InterpretedFunction.java:175)
at sun.org.mozilla.javascript.internal.Context.evaluateReader(Context.java:1159)
at com.sun.script.javascript.RhinoScriptEngine.eval(RhinoScriptEngine.java:210)
... 48 more
Caused by: com.sencha.exceptions.BasicException: java.lang.NullPointerException
at com.sencha.cli.Commands$Cmd.create(Commands.java:117)
at com.sencha.cli.Commands.findCommand(Commands.java:74)
at com.sencha.cli.Commands.dispatch(Commands.java:43)
at com.sencha.cli.Commands.dispatch(Commands.java:49)
at com.sencha.cli.AbstractCommand.dispatch(AbstractCommand.java:184)
at sun.reflect.NativeMethodAccessorImpl.invoke0(Native Method)
at sun.reflect.NativeMethodAccessorImpl.invoke(NativeMethodAccessorImpl.java:57)
at sun.reflect.DelegatingMethodAccessorImpl.invoke(DelegatingMethodAccessorImpl.java:43)
at java.lang.reflect.Method.invoke(Method.java:601)
at sun.org.mozilla.javascript.internal.MemberBox.invoke(MemberBox.java:169)
... 59 more
Caused by: java.lang.NullPointerException
at com.sencha.tools.compiler.MetaClassDefinition.resolveImplicitDependencies(MetaClassDefinition.java:705)
at com.sencha.tools.compiler.MetaClassDefinition.resolveImplicitDependencies(MetaClassDefinition.java:756)
at com.sencha.tools.compiler.MetaClassDefinition.resolveImplicitDependencies(MetaClassDefinition.java:756)
at com.sencha.tools.compiler.MetaClassDefinition.resolveImplicitDependencies(MetaClassDefinition.java:756)
at com.sencha.tools.compiler.MetaClassDefinition.resolveImplicitDependencies(MetaClassDefinition.java:756)
at com.sencha.tools.compiler.MetaClassDefinition.resolveImplicitDependencies(MetaClassDefinition.java:726)
at com.sencha.tools.compiler.MetaClassDefinition.resolveImplicitDependencies(MetaClassDefinition.java:756)
at com.sencha.tools.compiler.MetaClassDefinition.resolveImplicitDependencies(MetaClassDefinition.java:825)
at com.sencha.tools.compiler.MetaClassDefinition.resolveImplicitDependencies(MetaClassDefinition.java:852)
at com.sencha.tools.compiler.sources.SourceFileCache.resolveImplicitDependencies(SourceFileCache.java:480)
at com.sencha.command.compile.CompileCommands.getCache(CompileCommands.java:197)
at com.sencha.command.compile.CompileCommands.getCache(CompileCommands.java:153)
at com.sencha.command.compile.CompileCommands$BaseFilterCommand.<init>(CompileCommands.java:299)
at com.sencha.command.compile.CompileCommands$IncludeCommand.<init>(CompileCommands.java:419)
at com.sencha.command.compile.CompileCommands$UnionCommand.<init>(CompileCommands.java:424)
at com.sencha.command.compile.CompileCommands.createUnion(CompileCommands.java:1067)
at sun.reflect.NativeMethodAccessorImpl.invoke0(Native Method)
at sun.reflect.NativeMethodAccessorImpl.invoke(NativeMethodAccessorImpl.java:57)
at sun.reflect.DelegatingMethodAccessorImpl.invoke(DelegatingMethodAccessorImpl.java:43)
at java.lang.reflect.Method.invoke(Method.java:601)
at com.sencha.cli.Commands$Cmd.create(Commands.java:99)
... 68 more

dongryphon
28 Oct 2012, 10:46 PM
Thanks for the report! Either we need to not error out on this or we need to tell you the source file and line number of the problem.

I have opened a ticket for this.

dongryphon
28 Oct 2012, 10:50 PM
Looking at the debug log it appears there is an issue with the new auto-dependency logic and some piece of code in your project. Which is why I said above - we need to indicate the offending code or deal with it.

To find that needle in the haystack, we may need to first improve the error reporting here to give you the location in your code to inspect before we can discuss what the fix needs to be.

anwyn
29 Oct 2012, 6:23 AM
It seems we've got the same problem here:



[DEBUG] Adding implicit dependency on Ext.data.Model for App.data.AuthAjaxProxy to file /home/ole/workspace/xpm/xpm-main/xpm-main-war/src/main/webapp/touch/app/model/ReportLayout.js
[DEBUG] java.lang.NullPointerException
[DEBUG] removing tempdir /home/ole/workspace/xpm/xpm-main/xpm-main-war/src/main/webapp/touch/sencha-compile-temp-dir
[ERROR] BUILD FAILED


BUT: Sencha Cmd v3.0.0.201 failed at the same place with a slightly different error message:



[DEBUG] Adding implicit dependency on Ext.data.Model for App.data.AuthAjaxProxy to file /home/ole/workspace/xpm/xpm-main/xpm-main-war/src/main/webapp/touch/app/model/ReportLayout.js
[DEBUG] Adding implicit dependency on Ext.data.proxy.Proxy for reader.null to file /home/ole/workspace/xpm/xpm-main/xpm-main-war/src/main/webapp/touch/app/model/ReportLayout.js
[ERROR] def was null
[ERROR] failed to find meta class definition for name reader.null
[DEBUG] removing tempdir /home/ole/workspace/xpm/xpm-main/xpm-main-war/src/main/webapp/touch/sencha-compile-temp-dir
[ERROR] BUILD FAILED
[ERROR] com.sencha.exceptions.BasicException: The following error occurred while executing this line:
[ERROR] /home/ole/workspace/xpm/xpm-main/xpm-main-war/src/main/webapp/touch/.sencha/app/build-impl.xml:120: javax.script.ScriptException: sun.org.mozilla.javascript.internal.WrappedException: Wrapped com.sencha.exceptions.BasicException (<Unknown source>#461) in <Unknown source> at line number 461
[ERROR] at com.sencha.exceptions.BasicException.wrap(BasicException.java:43)


Cheers

Ole

olegtaranenko
30 Oct 2012, 5:43 AM
Looking at the debug log it appears there is an issue with the new auto-dependency logic and some piece of code in your project. Which is why I said above - we need to indicate the offending code or deal with it.

To find that needle in the haystack, we may need to first improve the error reporting here to give you the location in your code to inspect before we can discuss what the fix needs to be.

Thanks for answer. If you need more efforts from my side I'm ready to cooperate

Cheers, Oleg