PDA

View Full Version : [I bet it's not supposed to do this]Sencha-cmd crash on linux



phas
19 Dec 2012, 6:30 AM
Apparently sencha-cmd crashes on linux, at least the 64 bit version, here there is the stacktrace of me trying to build an application that builds and works perfectly with sencha-cmd on osx. I have the same problem on my windows workstation - a really up to date archlinux installation - while this is a debian server and the problem itself appears even on a freshly generated (sencha-cmd generate app ...) application, so i really really think that this is a bug.



tesole@XXXXXX:~/repo/tesolevents/tesolevents/tesolepanel$ ~/sencha-cmd/Sencha/Cmd/3.0.0.250/sencha-3.0.0.250 app buildSencha Cmd v3.0.0.250
[INF] init-properties:
[INF] init-sencha-command:
[INF] init:
[INF] -before-app-build:
[INF] app-build-impl:
[INF] production:
[INF] -before-init-local:
[INF] -init-local:
[INF] -after-init-local:
[INF] init-local:
[INF] find-cmd:
[INF] -before-init:
[INF] -init:
[INF] -after-init:
[INF] init:
[INF] -before-build:
[INF] sass:
[INF] -before-sass:
[INF] -sass:
[INF] [shellscript] identical app.css
[INF] Compressed 0 of 0 (0 up to date)
[INF] [copy] Copying 610 files to /home/tesole/repo/tesolevents/tesolevents/tesolepanel/build/tesolepanel/production
[INF] [copy] Copying 1256 files to /home/tesole/repo/tesolevents/tesolevents/tesolepanel/build/tesolepanel/production/ext
[INF] -after-sass:
[INF] theme:
[INF] -before-theme:
[INF] -theme:
[INF] Building theme
[INF] Capturing theme image
[ERR] BUILD FAILED
[ERR] com.sencha.exceptions.ExProcess: phantomjs process exited with code 1 :
[ERR] /home/tesole/sencha-cmd/Sencha/Cmd/3.0.0.250/phantomjs/phantom/bin/phantomjs: /usr/lib/libstdc++.so.6: version `GLIBCXX_3.4.11''''''''' not found (required by /home/tesole/sencha-cmd/Sencha/Cmd/3.0.0.250/phantomjs/phantom/bin/phantomjs)
[ERR] /home/tesole/sencha-cmd/Sencha/Cmd/3.0.0.250/phantomjs/phantom/bin/phantomjs: /lib/libc.so.6: version `GLIBC_2.9''''''''' not found (required by /home/tesole/sencha-cmd/Sencha/Cmd/3.0.0.250/phantomjs/phantom/bin/../lib/libQtGui.so.4)
[ERR] /home/tesole/sencha-cmd/Sencha/Cmd/3.0.0.250/phantomjs/phantom/bin/phantomjs: /lib/libc.so.6: version `GLIBC_2.11''''''''' not found (required by /home/tesole/sencha-cmd/Sencha/Cmd/3.0.0.250/phantomjs/phantom/bin/../lib/libQtGui.so.4)
[ERR] /home/tesole/sencha-cmd/Sencha/Cmd/3.0.0.250/phantomjs/phantom/bin/phantomjs: /lib/libc.so.6: version `GLIBC_2.10''''''''' not found (required by /home/tesole/sencha-cmd/Sencha/Cmd/3.0.0.250/phantomjs/phantom/bin/../lib/libQtNetwork.so.4)
[ERR] /home/tesole/sencha-cmd/Sencha/Cmd/3.0.0.250/phantomjs/phantom/bin/phantomjs: /lib/libc.so.6: version `GLIBC_2.9''''''''' not found (required by /home/tesole/sencha-cmd/Sencha/Cmd/3.0.0.250/phantomjs/phantom/bin/../lib/libQtCore.so.4)
[ERR] at com.sencha.command.theme.ThemeCommands$CaptureCommand.execute(ThemeCommands.java:232)
[ERR] at com.sencha.command.theme.ThemeCommands$BuildCommand.execute(ThemeCommands.java:173)
[ERR] at sun.reflect.NativeMethodAccessorImpl.invoke0(Native Method)
[ERR] at sun.reflect.NativeMethodAccessorImpl.invoke(Unknown Source)
[ERR] at sun.reflect.DelegatingMethodAccessorImpl.invoke(Unknown Source)
[ERR] at java.lang.reflect.Method.invoke(Unknown Source)
[ERR] at com.sencha.cli.Command.dispatch(Command.java:78)
[ERR] at com.sencha.cli.Commands.dispatch(Commands.java:49)
[ERR] at com.sencha.cli.Commands.dispatch(Commands.java:49)
[ERR] at com.sencha.cli.AbstractCommand.dispatch(AbstractCommand.java:182)
[ERR] at com.sencha.ant.SenchaCommandTask.doExecute(SenchaCommandTask.java:58)
[ERR] at com.sencha.ant.BaseAntTask.execute(BaseAntTask.java:22)
[ERR] at org.apache.tools.ant.UnknownElement.execute(UnknownElement.java:291)
[ERR] at sun.reflect.GeneratedMethodAccessor10.invoke(Unknown Source)
[ERR] at sun.reflect.DelegatingMethodAccessorImpl.invoke(Unknown Source)
[ERR] at java.lang.reflect.Method.invoke(Unknown Source)
[ERR] at org.apache.tools.ant.dispatch.DispatchUtils.execute(DispatchUtils.java:106)
[ERR] at org.apache.tools.ant.Task.perform(Task.java:348)
[ERR] at org.apache.tools.ant.taskdefs.Sequential.execute(Sequential.java:68)
[ERR] at org.apache.tools.ant.UnknownElement.execute(UnknownElement.java:291)
[ERR] at sun.reflect.GeneratedMethodAccessor10.invoke(Unknown Source)
[ERR] at sun.reflect.DelegatingMethodAccessorImpl.invoke(Unknown Source)
[ERR] at java.lang.reflect.Method.invoke(Unknown Source)
[ERR] at org.apache.tools.ant.dispatch.DispatchUtils.execute(DispatchUtils.java:106)
[ERR] at org.apache.tools.ant.Task.perform(Task.java:348)
[ERR] at org.apache.tools.ant.taskdefs.MacroInstance.execute(MacroInstance.java:398)
[ERR] at net.sf.antcontrib.logic.ForTask.doSequentialIteration(ForTask.java:259)
[ERR] at net.sf.antcontrib.logic.ForTask.doToken(ForTask.java:268)
[ERR] at net.sf.antcontrib.logic.ForTask.doTheTasks(ForTask.java:324)
[ERR] at net.sf.antcontrib.logic.ForTask.execute(ForTask.java:244)
[ERR] at org.apache.tools.ant.UnknownElement.execute(UnknownElement.java:291)
[ERR] at sun.reflect.GeneratedMethodAccessor10.invoke(Unknown Source)
[ERR] at sun.reflect.DelegatingMethodAccessorImpl.invoke(Unknown Source)
[ERR] at java.lang.reflect.Method.invoke(Unknown Source)
[ERR] at org.apache.tools.ant.dispatch.DispatchUtils.execute(DispatchUtils.java:106)
[ERR] at org.apache.tools.ant.Task.perform(Task.java:348)
[ERR] at org.apache.tools.ant.Target.execute(Target.java:392)
[ERR] at org.apache.tools.ant.Target.performTasks(Target.java:413)
[ERR] at org.apache.tools.ant.Project.executeSortedTargets(Project.java:1399)
[ERR] at org.apache.tools.ant.helper.SingleCheckExecutor.executeTargets(SingleCheckExecutor.java:38)
[ERR] at org.apache.tools.ant.Project.executeTargets(Project.java:1251)
[ERR] at org.apache.tools.ant.taskdefs.Ant.execute(Ant.java:442)
[ERR] at org.apache.tools.ant.taskdefs.CallTarget.execute(CallTarget.java:105)
[ERR] at org.apache.tools.ant.UnknownElement.execute(UnknownElement.java:291)
[ERR] at sun.reflect.GeneratedMethodAccessor10.invoke(Unknown Source)
[ERR] at sun.reflect.DelegatingMethodAccessorImpl.invoke(Unknown Source)
[ERR] at java.lang.reflect.Method.invoke(Unknown Source)
[ERR] at org.apache.tools.ant.dispatch.DispatchUtils.execute(DispatchUtils.java:106)
[ERR] at org.apache.tools.ant.Task.perform(Task.java:348)
[ERR] at org.apache.tools.ant.Target.execute(Target.java:392)
[ERR] at org.apache.tools.ant.Target.performTasks(Target.java:413)
[ERR] at org.apache.tools.ant.Project.executeSortedTargets(Project.java:1399)
[ERR] at org.apache.tools.ant.Project.executeTarget(Project.java:1368)
[ERR] at org.apache.tools.ant.helper.DefaultExecutor.executeTargets(DefaultExecutor.java:41)
[ERR] at org.apache.tools.ant.Project.executeTargets(Project.java:1251)
[ERR] at com.sencha.ant.AntRunner.run(AntRunner.java:156)
[ERR] at com.sencha.ant.AntRunner.run(AntRunner.java:80)
[ERR] at com.sencha.command.ant.AntCommand.execute(AntCommand.java:75)
[ERR] at sun.reflect.NativeMethodAccessorImpl.invoke0(Native Method)
[ERR] at sun.reflect.NativeMethodAccessorImpl.invoke(Unknown Source)
[ERR] at sun.reflect.DelegatingMethodAccessorImpl.invoke(Unknown Source)
[ERR] at java.lang.reflect.Method.invoke(Unknown Source)
[ERR] at com.sencha.cli.Command.dispatch(Command.java:78)
[ERR] at com.sencha.cli.Commands.dispatch(Commands.java:49)
[ERR] at com.sencha.cli.AbstractCommand.dispatch(AbstractCommand.java:182)
[ERR] at com.sencha.ant.SenchaCommandTask.doExecute(SenchaCommandTask.java:58)
[ERR] at com.sencha.ant.BaseAntTask.execute(BaseAntTask.java:22)
[ERR] at org.apache.tools.ant.UnknownElement.execute(UnknownElement.java:291)
[ERR] at sun.reflect.NativeMethodAccessorImpl.invoke0(Native Method)
[ERR] at sun.reflect.NativeMethodAccessorImpl.invoke(Unknown Source)
[ERR] at sun.reflect.DelegatingMethodAccessorImpl.invoke(Unknown Source)
[ERR] at java.lang.reflect.Method.invoke(Unknown Source)
[ERR] at org.apache.tools.ant.dispatch.DispatchUtils.execute(DispatchUtils.java:106)
[ERR] at org.apache.tools.ant.Task.perform(Task.java:348)
[ERR] at org.apache.tools.ant.Target.execute(Target.java:392)
[ERR] at org.apache.tools.ant.Target.performTasks(Target.java:413)
[ERR] at org.apache.tools.ant.Project.executeSortedTargets(Project.java:1399)
[ERR] at org.apache.tools.ant.Project.executeTarget(Project.java:1368)
[ERR] at org.apache.tools.ant.helper.DefaultExecutor.executeTargets(DefaultExecutor.java:41)
[ERR] at org.apache.tools.ant.Project.executeTargets(Project.java:1251)
[ERR] at com.sencha.ant.AntRunner.run(AntRunner.java:156)
[ERR] at com.sencha.ant.AntRunner.run(AntRunner.java:72)
[ERR] at com.sencha.command.BasePluginCommands$BasePluginCommand.run(BasePluginCommands.java:87)
[ERR] at com.sencha.command.BasePluginCommands$BasePluginCommand.run(BasePluginCommands.java:91)
[ERR] at com.sencha.command.BasePluginCommands$BaseNamePathCommand.run(BasePluginCommands.java:135)
[ERR] at com.sencha.command.app.AppCommands$BuildCommand.execute(AppCommands.java:106)
[ERR] at sun.reflect.NativeMethodAccessorImpl.invoke0(Native Method)
[ERR] at sun.reflect.NativeMethodAccessorImpl.invoke(Unknown Source)
[ERR] at sun.reflect.DelegatingMethodAccessorImpl.invoke(Unknown Source)
[ERR] at java.lang.reflect.Method.invoke(Unknown Source)
[ERR] at com.sencha.cli.Command.dispatch(Command.java:78)
[ERR] at com.sencha.cli.Commands.dispatch(Commands.java:49)
[ERR] at com.sencha.cli.Commands.dispatch(Commands.java:49)
[ERR] at com.sencha.command.Sencha.main(Sencha.java:71)
[ERR] Total time: 5 seconds
[ERR] BUILD FAILED
[ERR] com.sencha.exceptions.BasicException: The following error occurred while executing this line:
[ERR] /home/tesole/repo/tesolevents/tesolevents/tesolepanel/.sencha/app/build-impl.xml:207: The following error occurred while executing this line:
[ERR] /home/tesole/repo/tesolevents/tesolevents/tesolepanel/.sencha/app/build-impl.xml:213: com.sencha.exceptions.ExProcess: phantomjs process exited with code 1 :
[ERR] /home/tesole/sencha-cmd/Sencha/Cmd/3.0.0.250/phantomjs/phantom/bin/phantomjs: /usr/lib/libstdc++.so.6: version `GLIBCXX_3.4.11''''''''' not found (required by /home/tesole/sencha-cmd/Sencha/Cmd/3.0.0.250/phantomjs/phantom/bin/phantomjs)
[ERR] /home/tesole/sencha-cmd/Sencha/Cmd/3.0.0.250/phantomjs/phantom/bin/phantomjs: /lib/libc.so.6: version `GLIBC_2.9''''''''' not found (required by /home/tesole/sencha-cmd/Sencha/Cmd/3.0.0.250/phantomjs/phantom/bin/../lib/libQtGui.so.4)
[ERR] /home/tesole/sencha-cmd/Sencha/Cmd/3.0.0.250/phantomjs/phantom/bin/phantomjs: /lib/libc.so.6: version `GLIBC_2.11''''''''' not found (required by /home/tesole/sencha-cmd/Sencha/Cmd/3.0.0.250/phantomjs/phantom/bin/../lib/libQtGui.so.4)
[ERR] /home/tesole/sencha-cmd/Sencha/Cmd/3.0.0.250/phantomjs/phantom/bin/phantomjs: /lib/libc.so.6: version `GLIBC_2.10''''''''' not found (required by /home/tesole/sencha-cmd/Sencha/Cmd/3.0.0.250/phantomjs/phantom/bin/../lib/libQtNetwork.so.4)
[ERR] /home/tesole/sencha-cmd/Sencha/Cmd/3.0.0.250/phantomjs/phantom/bin/phantomjs: /lib/libc.so.6: version `GLIBC_2.9''''''''' not found (required by /home/tesole/sencha-cmd/Sencha/Cmd/3.0.0.250/phantomjs/phantom/bin/../lib/libQtCore.so.4)
[ERR] at com.sencha.exceptions.BasicException.wrap(BasicException.java:43)
[ERR] at com.sencha.cli.Command.dispatch(Command.java:104)
[ERR] at com.sencha.cli.Commands.dispatch(Commands.java:49)
[ERR] at com.sencha.cli.AbstractCommand.dispatch(AbstractCommand.java:182)
[ERR] at com.sencha.ant.SenchaCommandTask.doExecute(SenchaCommandTask.java:58)
[ERR] at com.sencha.ant.BaseAntTask.execute(BaseAntTask.java:22)
[ERR] at org.apache.tools.ant.UnknownElement.execute(UnknownElement.java:291)
[ERR] at sun.reflect.NativeMethodAccessorImpl.invoke0(Native Method)
[ERR] at sun.reflect.NativeMethodAccessorImpl.invoke(Unknown Source)
[ERR] at sun.reflect.DelegatingMethodAccessorImpl.invoke(Unknown Source)
[ERR] at java.lang.reflect.Method.invoke(Unknown Source)
[ERR] at org.apache.tools.ant.dispatch.DispatchUtils.execute(DispatchUtils.java:106)
[ERR] at org.apache.tools.ant.Task.perform(Task.java:348)
[ERR] at org.apache.tools.ant.Target.execute(Target.java:392)
[ERR] at org.apache.tools.ant.Target.performTasks(Target.java:413)
[ERR] at org.apache.tools.ant.Project.executeSortedTargets(Project.java:1399)
[ERR] at org.apache.tools.ant.Project.executeTarget(Project.java:1368)
[ERR] at org.apache.tools.ant.helper.DefaultExecutor.executeTargets(DefaultExecutor.java:41)
[ERR] at org.apache.tools.ant.Project.executeTargets(Project.java:1251)
[ERR] at com.sencha.ant.AntRunner.run(AntRunner.java:156)
[ERR] at com.sencha.ant.AntRunner.run(AntRunner.java:72)
[ERR] at com.sencha.command.BasePluginCommands$BasePluginCommand.run(BasePluginCommands.java:87)
[ERR] at com.sencha.command.BasePluginCommands$BasePluginCommand.run(BasePluginCommands.java:91)
[ERR] at com.sencha.command.BasePluginCommands$BaseNamePathCommand.run(BasePluginCommands.java:135)
[ERR] at com.sencha.command.app.AppCommands$BuildCommand.execute(AppCommands.java:106)
[ERR] at sun.reflect.NativeMethodAccessorImpl.invoke0(Native Method)
[ERR] at sun.reflect.NativeMethodAccessorImpl.invoke(Unknown Source)
[ERR] at sun.reflect.DelegatingMethodAccessorImpl.invoke(Unknown Source)
[ERR] at java.lang.reflect.Method.invoke(Unknown Source)
[ERR] at com.sencha.cli.Command.dispatch(Command.java:78)
[ERR] at com.sencha.cli.Commands.dispatch(Commands.java:49)
[ERR] at com.sencha.cli.Commands.dispatch(Commands.java:49)
[ERR] at com.sencha.command.Sencha.main(Sencha.java:71)
[ERR] Caused by: /home/tesole/repo/tesolevents/tesolevents/tesolepanel/.sencha/app/build-impl.xml:226: The following error occurred while executing this line:
[ERR] /home/tesole/repo/tesolevents/tesolevents/tesolepanel/.sencha/app/build-impl.xml:207: The following error occurred while executing this line:
[ERR] /home/tesole/repo/tesolevents/tesolevents/tesolepanel/.sencha/app/build-impl.xml:213: com.sencha.exceptions.ExProcess: phantomjs process exited with code 1 :
[ERR] /home/tesole/sencha-cmd/Sencha/Cmd/3.0.0.250/phantomjs/phantom/bin/phantomjs: /usr/lib/libstdc++.so.6: version `GLIBCXX_3.4.11''''''''' not found (required by /home/tesole/sencha-cmd/Sencha/Cmd/3.0.0.250/phantomjs/phantom/bin/phantomjs)
[ERR] /home/tesole/sencha-cmd/Sencha/Cmd/3.0.0.250/phantomjs/phantom/bin/phantomjs: /lib/libc.so.6: version `GLIBC_2.9''''''''' not found (required by /home/tesole/sencha-cmd/Sencha/Cmd/3.0.0.250/phantomjs/phantom/bin/../lib/libQtGui.so.4)
[ERR] /home/tesole/sencha-cmd/Sencha/Cmd/3.0.0.250/phantomjs/phantom/bin/phantomjs: /lib/libc.so.6: version `GLIBC_2.11''''''''' not found (required by /home/tesole/sencha-cmd/Sencha/Cmd/3.0.0.250/phantomjs/phantom/bin/../lib/libQtGui.so.4)
[ERR] /home/tesole/sencha-cmd/Sencha/Cmd/3.0.0.250/phantomjs/phantom/bin/phantomjs: /lib/libc.so.6: version `GLIBC_2.10''''''''' not found (required by /home/tesole/sencha-cmd/Sencha/Cmd/3.0.0.250/phantomjs/phantom/bin/../lib/libQtNetwork.so.4)
[ERR] /home/tesole/sencha-cmd/Sencha/Cmd/3.0.0.250/phantomjs/phantom/bin/phantomjs: /lib/libc.so.6: version `GLIBC_2.9''''''''' not found (required by /home/tesole/sencha-cmd/Sencha/Cmd/3.0.0.250/phantomjs/phantom/bin/../lib/libQtCore.so.4)
[ERR] at org.apache.tools.ant.ProjectHelper.addLocationToBuildException(ProjectHelper.java:551)
[ERR] at org.apache.tools.ant.taskdefs.Ant.execute(Ant.java:444)
[ERR] at org.apache.tools.ant.taskdefs.CallTarget.execute(CallTarget.java:105)
[ERR] at org.apache.tools.ant.UnknownElement.execute(UnknownElement.java:291)
[ERR] at sun.reflect.GeneratedMethodAccessor10.invoke(Unknown Source)
[ERR] at sun.reflect.DelegatingMethodAccessorImpl.invoke(Unknown Source)
[ERR] at java.lang.reflect.Method.invoke(Unknown Source)
[ERR] at org.apache.tools.ant.dispatch.DispatchUtils.execute(DispatchUtils.java:106)
[ERR] at org.apache.tools.ant.Task.perform(Task.java:348)
[ERR] at org.apache.tools.ant.Target.execute(Target.java:392)
[ERR] at org.apache.tools.ant.Target.performTasks(Target.java:413)
[ERR] at org.apache.tools.ant.Project.executeSortedTargets(Project.java:1399)
[ERR] at org.apache.tools.ant.Project.executeTarget(Project.java:1368)
[ERR] at org.apache.tools.ant.helper.DefaultExecutor.executeTargets(DefaultExecutor.java:41)
[ERR] at org.apache.tools.ant.Project.executeTargets(Project.java:1251)
[ERR] at com.sencha.ant.AntRunner.run(AntRunner.java:156)
[ERR] at com.sencha.ant.AntRunner.run(AntRunner.java:80)
[ERR] at com.sencha.command.ant.AntCommand.execute(AntCommand.java:75)
[ERR] at sun.reflect.NativeMethodAccessorImpl.invoke0(Native Method)
[ERR] at sun.reflect.NativeMethodAccessorImpl.invoke(Unknown Source)
[ERR] at sun.reflect.DelegatingMethodAccessorImpl.invoke(Unknown Source)
[ERR] at java.lang.reflect.Method.invoke(Unknown Source)
[ERR] at com.sencha.cli.Command.dispatch(Command.java:78)
[ERR] ... 31 more
[ERR] Caused by: /home/tesole/repo/tesolevents/tesolevents/tesolepanel/.sencha/app/build-impl.xml:207: The following error occurred while executing this line:
[ERR] /home/tesole/repo/tesolevents/tesolevents/tesolepanel/.sencha/app/build-impl.xml:213: com.sencha.exceptions.ExProcess: phantomjs process exited with code 1 :
[ERR] /home/tesole/sencha-cmd/Sencha/Cmd/3.0.0.250/phantomjs/phantom/bin/phantomjs: /usr/lib/libstdc++.so.6: version `GLIBCXX_3.4.11''''''''' not found (required by /home/tesole/sencha-cmd/Sencha/Cmd/3.0.0.250/phantomjs/phantom/bin/phantomjs)
[ERR] /home/tesole/sencha-cmd/Sencha/Cmd/3.0.0.250/phantomjs/phantom/bin/phantomjs: /lib/libc.so.6: version `GLIBC_2.9''''''''' not found (required by /home/tesole/sencha-cmd/Sencha/Cmd/3.0.0.250/phantomjs/phantom/bin/../lib/libQtGui.so.4)
[ERR] /home/tesole/sencha-cmd/Sencha/Cmd/3.0.0.250/phantomjs/phantom/bin/phantomjs: /lib/libc.so.6: version `GLIBC_2.11''''''''' not found (required by /home/tesole/sencha-cmd/Sencha/Cmd/3.0.0.250/phantomjs/phantom/bin/../lib/libQtGui.so.4)
[ERR] /home/tesole/sencha-cmd/Sencha/Cmd/3.0.0.250/phantomjs/phantom/bin/phantomjs: /lib/libc.so.6: version `GLIBC_2.10''''''''' not found (required by /home/tesole/sencha-cmd/Sencha/Cmd/3.0.0.250/phantomjs/phantom/bin/../lib/libQtNetwork.so.4)
[ERR] /home/tesole/sencha-cmd/Sencha/Cmd/3.0.0.250/phantomjs/phantom/bin/phantomjs: /lib/libc.so.6: version
[ERR] `GLIBC_2.9''''''''' not found (required by /home/tesole/sencha-cmd/Sencha/Cmd/3.0.0.250/phantomjs/phantom/bin/../lib/libQtCore.so.4)
[ERR] at org.apache.tools.ant.ProjectHelper.addLocationToBuildException(ProjectHelper.java:551)
[ERR] at org.apache.tools.ant.taskdefs.MacroInstance.execute(MacroInstance.java:401)
[ERR] at net.sf.antcontrib.logic.ForTask.doSequentialIteration(ForTask.java:259)
[ERR] at net.sf.antcontrib.logic.ForTask.doToken(ForTask.java:268)
[ERR] at net.sf.antcontrib.logic.ForTask.doTheTasks(ForTask.java:324)
[ERR] at net.sf.antcontrib.logic.ForTask.execute(ForTask.java:244)
[ERR] at org.apache.tools.ant.UnknownElement.execute(UnknownElement.java:291)
[ERR] at sun.reflect.GeneratedMethodAccessor10.invoke(Unknown Source)
[ERR] at sun.reflect.DelegatingMethodAccessorImpl.invoke(Unknown Source)
[ERR] at java.lang.reflect.Method.invoke(Unknown Source)
[ERR] at org.apache.tools.ant.dispatch.DispatchUtils.execute(DispatchUtils.java:106)
[ERR] at org.apache.tools.ant.Task.perform(Task.java:348)
[ERR] at org.apache.tools.ant.Target.execute(Target.java:392)
[ERR] at org.apache.tools.ant.Target.performTasks(Target.java:413)
[ERR] at org.apache.tools.ant.Project.executeSortedTargets(Project.java:1399)
[ERR] at org.apache.tools.ant.helper.SingleCheckExecutor.executeTargets(SingleCheckExecutor.java:38)
[ERR] at org.apache.tools.ant.Project.executeTargets(Project.java:1251)
[ERR] at org.apache.tools.ant.taskdefs.Ant.execute(Ant.java:442)
[ERR] ... 52 more
[ERR] Caused by: /home/tesole/repo/tesolevents/tesolevents/tesolepanel/.sencha/app/build-impl.xml:213: com.sencha.exceptions.ExProcess: phantomjs process exited with code 1 :
[ERR] /home/tesole/sencha-cmd/Sencha/Cmd/3.0.0.250/phantomjs/phantom/bin/phantomjs: /usr/lib/libstdc++.so.6: version `GLIBCXX_3.4.11''''''''' not found (required by /home/tesole/sencha-cmd/Sencha/Cmd/3.0.0.250/phantomjs/phantom/bin/phantomjs)
[ERR] /home/tesole/sencha-cmd/Sencha/Cmd/3.0.0.250/phantomjs/phantom/bin/phantomjs: /lib/libc.so.6: version `GLIBC_2.9''''''''' not found (required by /home/tesole/sencha-cmd/Sencha/Cmd/3.0.0.250/phantomjs/phantom/bin/../lib/libQtGui.so.4)
[ERR] /home/tesole/sencha-cmd/Sencha/Cmd/3.0.0.250/phantomjs/phantom/bin/phantomjs: /lib/libc.so.6: version `GLIBC_2.11''''''''' not found (required by /home/tesole/sencha-cmd/Sencha/Cmd/3.0.0.250/phantomjs/phantom/bin/../lib/libQtGui.so.4)
[ERR] /home/tesole/sencha-cmd/Sencha/Cmd/3.0.0.250/phantomjs/phantom/bin/phantomjs: /lib/libc.so.6: version `GLIBC_2.10''''''''' not found (required by /home/tesole/sencha-cmd/Sencha/Cmd/3.0.0.250/phantomjs/phantom/bin/../lib/libQtNetwork.so.4)
[ERR] /home/tesole/sencha-cmd/Sencha/Cmd/3.0.0.250/phantomjs/phantom/bin/phantomjs: /lib/libc.so.6: version `GLIBC_2.9''''''''' not found (required by /home/tesole/sencha-cmd/Sencha/Cmd/3.0.0.250/phantomjs/phantom/bin/../lib/libQtCore.so.4)
[ERR] at org.apache.tools.ant.dispatch.DispatchUtils.execute(DispatchUtils.java:116)
[ERR] at org.apache.tools.ant.Task.perform(Task.java:348)
[ERR] at org.apache.tools.ant.taskdefs.Sequential.execute(Sequential.java:68)
[ERR] at org.apache.tools.ant.UnknownElement.execute(UnknownElement.java:291)
[ERR] at sun.reflect.GeneratedMethodAccessor10.invoke(Unknown Source)
[ERR] at sun.reflect.DelegatingMethodAccessorImpl.invoke(Unknown Source)
[ERR] at java.lang.reflect.Method.invoke(Unknown Source)
[ERR] at org.apache.tools.ant.dispatch.DispatchUtils.execute(DispatchUtils.java:106)
[ERR] at org.apache.tools.ant.Task.perform(Task.java:348)
[ERR] at org.apache.tools.ant.taskdefs.MacroInstance.execute(MacroInstance.java:398)
[ERR] ... 68 more
[ERR] Caused by: com.sencha.exceptions.ExProcess: phantomjs process exited with code 1 :
[ERR] /home/tesole/sencha-cmd/Sencha/Cmd/3.0.0.250/phantomjs/phantom/bin/phantomjs: /usr/lib/libstdc++.so.6: version `GLIBCXX_3.4.11''''''''' not found (required by /home/tesole/sencha-cmd/Sencha/Cmd/3.0.0.250/phantomjs/phantom/bin/phantomjs)
[ERR] /home/tesole/sencha-cmd/Sencha/Cmd/3.0.0.250/phantomjs/phantom/bin/phantomjs: /lib/libc.so.6: version `GLIBC_2.9''''''''' not found (required by /home/tesole/sencha-cmd/Sencha/Cmd/3.0.0.250/phantomjs/phantom/bin/../lib/libQtGui.so.4)
[ERR] /home/tesole/sencha-cmd/Sencha/Cmd/3.0.0.250/phantomjs/phantom/bin/phantomjs: /lib/libc.so.6: version `GLIBC_2.11''''''''' not found (required by /home/tesole/sencha-cmd/Sencha/Cmd/3.0.0.250/phantomjs/phantom/bin/../lib/libQtGui.so.4)
[ERR] /home/tesole/sencha-cmd/Sencha/Cmd/3.0.0.250/phantomjs/phantom/bin/phantomjs: /lib/libc.so.6: version `GLIBC_2.10''''''''' not found (required by /home/tesole/sencha-cmd/Sencha/Cmd/3.0.0.250/phantomjs/phantom/bin/../lib/libQtNetwork.so.4)
[ERR] /home/tesole/sencha-cmd/Sencha/Cmd/3.0.0.250/phantomjs/phantom/bin/phantomjs: /lib/libc.so.6: version `GLIBC_2.9''''''''' not found (required by /home/tesole/sencha-cmd/Sencha/Cmd/3.0.0.250/phantomjs/phantom/bin/../lib/libQtCore.so.4)
[ERR] at com.sencha.command.theme.ThemeCommands$CaptureCommand.execute(ThemeCommands.java:232)
[ERR] at com.sencha.command.theme.ThemeCommands$BuildCommand.execute(ThemeCommands.java:173)
[ERR] at sun.reflect.NativeMethodAccessorImpl.invoke0(Native Method)
[ERR] at sun.reflect.NativeMethodAccessorImpl.invoke(Unknown Source)
[ERR] at sun.reflect.DelegatingMethodAccessorImpl.invoke(Unknown Source)
[ERR] at java.lang.reflect.Method.invoke(Unknown Source)
[ERR] at com.sencha.cli.Command.dispatch(Command.java:78)
[ERR] at com.sencha.cli.Commands.dispatch(Commands.java:49)
[ERR] at com.sencha.cli.Commands.dispatch(Commands.java:49)
[ERR] at com.sencha.cli.AbstractCommand.dispatch(AbstractCommand.java:182)
[ERR] at com.sencha.ant.SenchaCommandTask.doExecute(SenchaCommandTask.java:58)
[ERR] at com.sencha.ant.BaseAntTask.execute(BaseAntTask.java:22)
[ERR] at org.apache.tools.ant.UnknownElement.execute(UnknownElement.java:291)
[ERR] at sun.reflect.GeneratedMethodAccessor10.invoke(Unknown Source)
[ERR] at sun.reflect.DelegatingMethodAccessorImpl.invoke(Unknown Source)
[ERR] at java.lang.reflect.Method.invoke(Unknown Source)
[ERR] at org.apache.tools.ant.dispatch.DispatchUtils.execute(DispatchUtils.java:106)
[ERR] ... 77 more
[ERR] Total time: 5 seconds
[ERR] com.sencha.exceptions.BasicException: The following error occurred while executing this line:
/home/tesole/repo/tesolevents/tesolevents/tesolepanel/.sencha/app/build-impl.xml:207: The following error occurred while executing this line:
/home/tesole/repo/tesolevents/tesolevents/tesolepanel/.sencha/app/build-impl.xml:213: com.sencha.exceptions.ExProcess: phantomjs process exited with code 1 :
/home/tesole/sencha-cmd/Sencha/Cmd/3.0.0.250/phantomjs/phantom/bin/phantomjs: /usr/lib/libstdc++.so.6: version `GLIBCXX_3.4.11''' not found (required by /home/tesole/sencha-cmd/Sencha/Cmd/3.0.0.250/phantomjs/phantom/bin/phantomjs)
/home/tesole/sencha-cmd/Sencha/Cmd/3.0.0.250/phantomjs/phantom/bin/phantomjs: /lib/libc.so.6: version `GLIBC_2.9''' not found (required by /home/tesole/sencha-cmd/Sencha/Cmd/3.0.0.250/phantomjs/phantom/bin/../lib/libQtGui.so.4)
/home/tesole/sencha-cmd/Sencha/Cmd/3.0.0.250/phantomjs/phantom/bin/phantomjs: /lib/libc.so.6: version `GLIBC_2.11''' not found (required by /home/tesole/sencha-cmd/Sencha/Cmd/3.0.0.250/phantomjs/phantom/bin/../lib/libQtGui.so.4)
/home/tesole/sencha-cmd/Sencha/Cmd/3.0.0.250/phantomjs/phantom/bin/phantomjs: /lib/libc.so.6: version `GLIBC_2.10''' not found (required by /home/tesole/sencha-cmd/Sencha/Cmd/3.0.0.250/phantomjs/phantom/bin/../lib/libQtNetwork.so.4)
/home/tesole/sencha-cmd/Sencha/Cmd/3.0.0.250/phantomjs/phantom/bin/phantomjs: /lib/libc.so.6: version `GLIBC_2.9''' not found (required by /home/tesole/sencha-cmd/Sencha/Cmd/3.0.0.250/phantomjs/phantom/bin/../lib/libQtCore.so.4)

dongryphon
20 Dec 2012, 1:20 AM
The relevant problem looks like missing libraries/packages:



[ERR] /home/tesole/sencha-cmd/Sencha/Cmd/3.0.0.250/phantomjs/phantom/bin/phantomjs: /usr/lib/libstdc++.so.6: version `GLIBCXX_3.4.11''''''''' not found (required by /home/tesole/sencha-cmd/Sencha/Cmd/3.0.0.250/phantomjs/phantom/bin/phantomjs)
[ERR] /home/tesole/sencha-cmd/Sencha/Cmd/3.0.0.250/phantomjs/phantom/bin/phantomjs: /lib/libc.so.6: version `GLIBC_2.9''''''''' not found (required by /home/tesole/sencha-cmd/Sencha/Cmd/3.0.0.250/phantomjs/phantom/bin/../lib/libQtGui.so.4)
[ERR] /home/tesole/sencha-cmd/Sencha/Cmd/3.0.0.250/phantomjs/phantom/bin/phantomjs: /lib/libc.so.6: version `GLIBC_2.11''''''''' not found (required by /home/tesole/sencha-cmd/Sencha/Cmd/3.0.0.250/phantomjs/phantom/bin/../lib/libQtGui.so.4)
[ERR] /home/tesole/sencha-cmd/Sencha/Cmd/3.0.0.250/phantomjs/phantom/bin/phantomjs: /lib/libc.so.6: version `GLIBC_2.10''''''''' not found (required by /home/tesole/sencha-cmd/Sencha/Cmd/3.0.0.250/phantomjs/phantom/bin/../lib/libQtNetwork.so.4)
[ERR] /home/tesole/sencha-cmd/Sencha/Cmd/3.0.0.250/phantomjs/phantom/bin/phantomjs: /lib/libc.so.6: version `GLIBC_2.9''''''''' not found (required by /home/tesole/sencha-cmd/Sencha/Cmd/3.0.0.250/phantomjs/phantom/bin/../lib/libQtCore.so.4)

phas
20 Dec 2012, 5:47 AM
mh, ok, aparently the error is differen on the other machine


Sencha Cmd v3.0.0.250[INF] init-properties:
[INF] init-sencha-command:
[INF] init:
[INF] -before-app-build:
[INF] app-build-impl:
[INF] production:
[INF] -before-init-local:
[INF] -init-local:
[INF] -after-init-local:
[INF] init-local:
[INF] find-cmd:
[INF] -before-init:
[INF] -init:
[INF] -after-init:
[INF] init:
[INF] -before-build:
[INF] sass:
[INF] -before-sass:
[INF] -sass:
[INF] [shellscript] identical app.css
[INF] Compressed 0 of 1 (1 up to date)
[INF] [copy] Copying 1 file to /home/phas/projects/Tesolevents/tesolevents/tesolepanel/build/tesolepanel/production
[INF] -after-sass:
[INF] theme:
[INF] -before-theme:
[INF] -theme:
[INF] Building theme
[INF] Capturing theme image
[ERR] BUILD FAILED
[ERR] com.sencha.exceptions.ExProcess: phantomjs process exited with code 139 :
[ERR] loading page resources/theme/default/theme.html
[ERR] capturing screenshot
[ERR] capturing widget location data
[ERR] widget capture complete
[ERR] at com.sencha.command.theme.ThemeCommands$CaptureCommand.execute(ThemeCommands.java:232)
[ERR] at com.sencha.command.theme.ThemeCommands$BuildCommand.execute(ThemeCommands.java:173)
[ERR] at sun.reflect.NativeMethodAccessorImpl.invoke0(Native Method)
[ERR] at sun.reflect.NativeMethodAccessorImpl.invoke(NativeMethodAccessorImpl.java:57)
[ERR] at sun.reflect.DelegatingMethodAccessorImpl.invoke(DelegatingMethodAccessorImpl.java:43)
[ERR] at java.lang.reflect.Method.invoke(Method.java:601)
[ERR] at com.sencha.cli.Command.dispatch(Command.java:78)
[ERR] at com.sencha.cli.Commands.dispatch(Commands.java:49)
[ERR] at com.sencha.cli.Commands.dispatch(Commands.java:49)
[ERR] at com.sencha.cli.AbstractCommand.dispatch(AbstractCommand.java:182)
[ERR] at com.sencha.ant.SenchaCommandTask.doExecute(SenchaCommandTask.java:58)
[ERR] at com.sencha.ant.BaseAntTask.execute(BaseAntTask.java:22)
[ERR] at org.apache.tools.ant.UnknownElement.execute(UnknownElement.java:291)
[ERR] at sun.reflect.GeneratedMethodAccessor9.invoke(Unknown Source)
[ERR] at sun.reflect.DelegatingMethodAccessorImpl.invoke(DelegatingMethodAccessorImpl.java:43)
[ERR] at java.lang.reflect.Method.invoke(Method.java:601)
[ERR] at org.apache.tools.ant.dispatch.DispatchUtils.execute(DispatchUtils.java:106)
[ERR] at org.apache.tools.ant.Task.perform(Task.java:348)
[ERR] at org.apache.tools.ant.taskdefs.Sequential.execute(Sequential.java:68)
[ERR] at org.apache.tools.ant.UnknownElement.execute(UnknownElement.java:291)
[ERR] at sun.reflect.GeneratedMethodAccessor9.invoke(Unknown Source)
[ERR] at sun.reflect.DelegatingMethodAccessorImpl.invoke(DelegatingMethodAccessorImpl.java:43)
[ERR] at java.lang.reflect.Method.invoke(Method.java:601)
[ERR] at org.apache.tools.ant.dispatch.DispatchUtils.execute(DispatchUtils.java:106)
[ERR] at org.apache.tools.ant.Task.perform(Task.java:348)
[ERR] at org.apache.tools.ant.taskdefs.MacroInstance.execute(MacroInstance.java:398)
[ERR] at net.sf.antcontrib.logic.ForTask.doSequentialIteration(ForTask.java:259)
[ERR] at net.sf.antcontrib.logic.ForTask.doToken(ForTask.java:268)
[ERR] at net.sf.antcontrib.logic.ForTask.doTheTasks(ForTask.java:324)
[ERR] at net.sf.antcontrib.logic.ForTask.execute(ForTask.java:244)
[ERR] at org.apache.tools.ant.UnknownElement.execute(UnknownElement.java:291)
[ERR] at sun.reflect.GeneratedMethodAccessor9.invoke(Unknown Source)
[ERR] at sun.reflect.DelegatingMethodAccessorImpl.invoke(DelegatingMethodAccessorImpl.java:43)
[ERR] at java.lang.reflect.Method.invoke(Method.java:601)
[ERR] at org.apache.tools.ant.dispatch.DispatchUtils.execute(DispatchUtils.java:106)
[ERR] at org.apache.tools.ant.Task.perform(Task.java:348)
[ERR] at org.apache.tools.ant.Target.execute(Target.java:392)
[ERR] at org.apache.tools.ant.Target.performTasks(Target.java:413)
[ERR] at org.apache.tools.ant.Project.executeSortedTargets(Project.java:1399)
[ERR] at org.apache.tools.ant.helper.SingleCheckExecutor.executeTargets(SingleCheckExecutor.java:38)
[ERR] at org.apache.tools.ant.Project.executeTargets(Project.java:1251)
[ERR] at org.apache.tools.ant.taskdefs.Ant.execute(Ant.java:442)
[ERR] at org.apache.tools.ant.taskdefs.CallTarget.execute(CallTarget.java:105)
[ERR] at org.apache.tools.ant.UnknownElement.execute(UnknownElement.java:291)
[ERR] at sun.reflect.GeneratedMethodAccessor9.invoke(Unknown Source)
[ERR] at sun.reflect.DelegatingMethodAccessorImpl.invoke(DelegatingMethodAccessorImpl.java:43)
[ERR] at java.lang.reflect.Method.invoke(Method.java:601)
[ERR] at org.apache.tools.ant.dispatch.DispatchUtils.execute(DispatchUtils.java:106)
[ERR] at org.apache.tools.ant.Task.perform(Task.java:348)
[ERR] at org.apache.tools.ant.Target.execute(Target.java:392)
[ERR] at org.apache.tools.ant.Target.performTasks(Target.java:413)
[ERR] at org.apache.tools.ant.Project.executeSortedTargets(Project.java:1399)
[ERR] at org.apache.tools.ant.Project.executeTarget(Project.java:1368)
[ERR] at org.apache.tools.ant.helper.DefaultExecutor.executeTargets(DefaultExecutor.java:41)
[ERR] at org.apache.tools.ant.Project.executeTargets(Project.java:1251)
[ERR] at com.sencha.ant.AntRunner.run(AntRunner.java:156)
[ERR] at com.sencha.ant.AntRunner.run(AntRunner.java:80)
[ERR] at com.sencha.command.ant.AntCommand.execute(AntCommand.java:75)
[ERR] at sun.reflect.NativeMethodAccessorImpl.invoke0(Native Method)
[ERR] at sun.reflect.NativeMethodAccessorImpl.invoke(NativeMethodAccessorImpl.java:57)
[ERR] at sun.reflect.DelegatingMethodAccessorImpl.invoke(DelegatingMethodAccessorImpl.java:43)
[ERR] at java.lang.reflect.Method.invoke(Method.java:601)
[ERR] at com.sencha.cli.Command.dispatch(Command.java:78)
[ERR] at com.sencha.cli.Commands.dispatch(Commands.java:49)
[ERR] at com.sencha.cli.AbstractCommand.dispatch(AbstractCommand.java:182)
[ERR] at com.sencha.ant.SenchaCommandTask.doExecute(SenchaCommandTask.java:58)
[ERR] at com.sencha.ant.BaseAntTask.execute(BaseAntTask.java:22)
[ERR] at org.apache.tools.ant.UnknownElement.execute(UnknownElement.java:291)
[ERR] at sun.reflect.NativeMethodAccessorImpl.invoke0(Native Method)
[ERR] at sun.reflect.NativeMethodAccessorImpl.invoke(NativeMethodAccessorImpl.java:57)
[ERR] at sun.reflect.DelegatingMethodAccessorImpl.invoke(DelegatingMethodAccessorImpl.java:43)
[ERR] at java.lang.reflect.Method.invoke(Method.java:601)
[ERR] at org.apache.tools.ant.dispatch.DispatchUtils.execute(DispatchUtils.java:106)
[ERR] at org.apache.tools.ant.Task.perform(Task.java:348)
[ERR] at org.apache.tools.ant.Target.execute(Target.java:392)
[ERR] at org.apache.tools.ant.Target.performTasks(Target.java:413)
[ERR] at org.apache.tools.ant.Project.executeSortedTargets(Project.java:1399)
[ERR] at org.apache.tools.ant.Project.executeTarget(Project.java:1368)
[ERR] at org.apache.tools.ant.helper.DefaultExecutor.executeTargets(DefaultExecutor.java:41)
[ERR] at org.apache.tools.ant.Project.executeTargets(Project.java:1251)
[ERR] at com.sencha.ant.AntRunner.run(AntRunner.java:156)
[ERR] at com.sencha.ant.AntRunner.run(AntRunner.java:72)
[ERR] at com.sencha.command.BasePluginCommands$BasePluginCommand.run(BasePluginCommands.java:87)
[ERR] at com.sencha.command.BasePluginCommands$BasePluginCommand.run(BasePluginCommands.java:91)
[ERR] at com.sencha.command.BasePluginCommands$BaseNamePathCommand.run(BasePluginCommands.java:135)
[ERR] at com.sencha.command.app.AppCommands$BuildCommand.execute(AppCommands.java:106)
[ERR] at sun.reflect.NativeMethodAccessorImpl.invoke0(Native Method)
[ERR] at sun.reflect.NativeMethodAccessorImpl.invoke(NativeMethodAccessorImpl.java:57)
[ERR] at sun.reflect.DelegatingMethodAccessorImpl.invoke(DelegatingMethodAccessorImpl.java:43)
[ERR] at java.lang.reflect.Method.invoke(Method.java:601)
[ERR] at com.sencha.cli.Command.dispatch(Command.java:78)
[ERR] at com.sencha.cli.Commands.dispatch(Commands.java:49)
[ERR] at com.sencha.cli.Commands.dispatch(Commands.java:49)
[ERR] at com.sencha.command.Sencha.main(Sencha.java:71)
[ERR] Total time: 6 seconds
[ERR] BUILD FAILED
[ERR] com.sencha.exceptions.BasicException: The following error occurred while executing this line:
[ERR] /home/phas/projects/Tesolevents/tesolevents/tesolepanel/.sencha/app/build-impl.xml:207: The following error occurred while executing this line:
[ERR] /home/phas/projects/Tesolevents/tesolevents/tesolepanel/.sencha/app/build-impl.xml:213: com.sencha.exceptions.ExProcess: phantomjs process exited with code 139 :
[ERR] loading page resources/theme/default/theme.html
[ERR] capturing screenshot
[ERR] capturing widget location data
[ERR] widget capture complete
[ERR] at com.sencha.exceptions.BasicException.wrap(BasicException.java:43)
[ERR] at com.sencha.cli.Command.dispatch(Command.java:104)
[ERR] at com.sencha.cli.Commands.dispatch(Commands.java:49)
[ERR] at com.sencha.cli.AbstractCommand.dispatch(AbstractCommand.java:182)
[ERR] at com.sencha.ant.SenchaCommandTask.doExecute(SenchaCommandTask.java:58)
[ERR] at com.sencha.ant.BaseAntTask.execute(BaseAntTask.java:22)
[ERR] at org.apache.tools.ant.UnknownElement.execute(UnknownElement.java:291)
[ERR] at sun.reflect.NativeMethodAccessorImpl.invoke0(Native Method)
[ERR] at sun.reflect.NativeMethodAccessorImpl.invoke(NativeMethodAccessorImpl.java:57)
[ERR] at sun.reflect.DelegatingMethodAccessorImpl.invoke(DelegatingMethodAccessorImpl.java:43)
[ERR] at java.lang.reflect.Method.invoke(Method.java:601)
[ERR] at org.apache.tools.ant.dispatch.DispatchUtils.execute(DispatchUtils.java:106)
[ERR] at org.apache.tools.ant.Task.perform(Task.java:348)
[ERR] at org.apache.tools.ant.Target.execute(Target.java:392)
[ERR] at org.apache.tools.ant.Target.performTasks(Target.java:413)
[ERR] at org.apache.tools.ant.Project.executeSortedTargets(Project.java:1399)
[ERR] at org.apache.tools.ant.Project.executeTarget(Project.java:1368)
[ERR] at org.apache.tools.ant.helper.DefaultExecutor.executeTargets(DefaultExecutor.java:41)
[ERR] at org.apache.tools.ant.Project.executeTargets(Project.java:1251)
[ERR] at com.sencha.ant.AntRunner.run(AntRunner.java:156)
[ERR] at com.sencha.ant.AntRunner.run(AntRunner.java:72)
[ERR] at com.sencha.command.BasePluginCommands$BasePluginCommand.run(BasePluginCommands.java:87)
[ERR] at com.sencha.command.BasePluginCommands$BasePluginCommand.run(BasePluginCommands.java:91)
[ERR] at com.sencha.command.BasePluginCommands$BaseNamePathCommand.run(BasePluginCommands.java:135)
[ERR] at com.sencha.command.app.AppCommands$BuildCommand.execute(AppCommands.java:106)
[ERR] at sun.reflect.NativeMethodAccessorImpl.invoke0(Native Method)
[ERR] at sun.reflect.NativeMethodAccessorImpl.invoke(NativeMethodAccessorImpl.java:57)
[ERR] at sun.reflect.DelegatingMethodAccessorImpl.invoke(DelegatingMethodAccessorImpl.java:43)
[ERR] at java.lang.reflect.Method.invoke(Method.java:601)
[ERR] at com.sencha.cli.Command.dispatch(Command.java:78)
[ERR] at com.sencha.cli.Commands.dispatch(Commands.java:49)
[ERR] at com.sencha.cli.Commands.dispatch(Commands.java:49)
[ERR] at com.sencha.command.Sencha.main(Sencha.java:71)
[ERR] Caused by: /home/phas/projects/Tesolevents/tesolevents/tesolepanel/.sencha/app/build-impl.xml:226: The following error occurred while executing this line:
[ERR] /home/phas/projects/Tesolevents/tesolevents/tesolepanel/.sencha/app/build-impl.xml:207: The following error occurred while executing this line:
[ERR] /home/phas/projects/Tesolevents/tesolevents/tesolepanel/.sencha/app/build-impl.xml:213: com.sencha.exceptions.ExProcess: phantomjs process exited with code 139 :
[ERR] loading page resources/theme/default/theme.html
[ERR] capturing screenshot
[ERR] capturing widget location data
[ERR] widget capture complete
[ERR] at org.apache.tools.ant.ProjectHelper.addLocationToBuildException(ProjectHelper.java:551)
[ERR] at org.apache.tools.ant.taskdefs.Ant.execute(Ant.java:444)
[ERR] at org.apache.tools.ant.taskdefs.CallTarget.execute(CallTarget.java:105)
[ERR] at org.apache.tools.ant.UnknownElement.execute(UnknownElement.java:291)
[ERR] at sun.reflect.GeneratedMethodAccessor9.invoke(Unknown Source)
[ERR] at sun.reflect.DelegatingMethodAccessorImpl.invoke(DelegatingMethodAccessorImpl.java:43)
[ERR] at java.lang.reflect.Method.invoke(Method.java:601)
[ERR] at org.apache.tools.ant.dispatch.DispatchUtils.execute(DispatchUtils.java:106)
[ERR] at org.apache.tools.ant.Task.perform(Task.java:348)
[ERR] at org.apache.tools.ant.Target.execute(Target.java:392)
[ERR] at org.apache.tools.ant.Target.performTasks(Target.java:413)
[ERR] at org.apache.tools.ant.Project.executeSortedTargets(Project.java:1399)
[ERR] at org.apache.tools.ant.Project.executeTarget(Project.java:1368)
[ERR] at org.apache.tools.ant.helper.DefaultExecutor.executeTargets(DefaultExecutor.java:41)
[ERR] at org.apache.tools.ant.Project.executeTargets(Project.java:1251)
[ERR] at com.sencha.ant.AntRunner.run(AntRunner.java:156)
[ERR] at com.sencha.ant.AntRunner.run(AntRunner.java:80)
[ERR] at com.sencha.command.ant.AntCommand.execute(AntCommand.java:75)
[ERR] at sun.reflect.NativeMethodAccessorImpl.invoke0(Native Method)
[ERR] at sun.reflect.NativeMethodAccessorImpl.invoke(NativeMethodAccessorImpl.java:57)
[ERR] at sun.reflect.DelegatingMethodAccessorImpl.invoke(DelegatingMethodAccessorImpl.java:43)
[ERR] at java.lang.reflect.Method.invoke(Method.java:601)
[ERR] at com.sencha.cli.Command.dispatch(Command.java:78)
[ERR] ... 31 more
[ERR] Caused by: /home/phas/projects/Tesolevents/tesolevents/tesolepanel/.sencha/app/build-impl.xml:207: The following error occurred while executing this line:
[ERR] /home/phas/projects/Tesolevents/tesolevents/tesolepanel/.sencha/app/build-impl.xml:213: com.sencha.exceptions.ExProcess: phantomjs process exited with code 139 :
[ERR] loading page resources/theme/default/theme.html
[ERR] capturing screenshot
[ERR] capturing widget location data
[ERR] widget capture complete
[ERR] at org.apache.tools.ant.ProjectHelper.addLocationToBuildException(ProjectHelper.java:551)
[ERR] at org.apache.tools.ant.taskdefs.MacroInstance.execute(MacroInstance.java:401)
[ERR] at net.sf.antcontrib.logic.ForTask.doSequentialIteration(ForTask.java:259)
[ERR] at net.sf.antcontrib.logic.ForTask.doToken(ForTask.java:268)
[ERR] at net.sf.antcontrib.logic.ForTask.doTheTasks(ForTask.java:324)
[ERR] at net.sf.antcontrib.logic.ForTask.execute(ForTask.java:244)
[ERR] at org.apache.tools.ant.UnknownElement.execute(UnknownElement.java:291)
[ERR] at sun.reflect.GeneratedMethodAccessor9.invoke(Unknown Source)
[ERR] at sun.reflect.DelegatingMethodAccessorImpl.invoke(DelegatingMethodAccessorImpl.java:43)
[ERR] at java.lang.reflect.Method.invoke(Method.java:601)
[ERR] at org.apache.tools.ant.dispatch.DispatchUtils.execute(DispatchUtils.java:106)
[ERR] at org.apache.tools.ant.Task.perform(Task.java:348)
[ERR] at org.apache.tools.ant.Target.execute(Target.java:392)
[ERR] at org.apache.tools.ant.Target.performTasks(Target.java:413)
[ERR] at org.apache.tools.ant.Project.executeSortedTargets(Project.java:1399)
[ERR] at org.apache.tools.ant.helper.SingleCheckExecutor.executeTargets(SingleCheckExecutor.java:38)
[ERR] at org.apache.tools.ant.Project.executeTargets(Project.java:1251)
[ERR] at org.apache.tools.ant.taskdefs.Ant.execute(Ant.java:442)
[ERR] ... 52 more
[ERR] Caused by: /home/phas/projects/Tesolevents/tesolevents/tesolepanel/.sencha/app/build-impl.xml:213: com.sencha.exceptions.ExProcess: phantomjs process exited with code 139 :
[ERR] loading page resources/theme/default/theme.html
[ERR] capturing screenshot
[ERR] capturing widget location data
[ERR] widget capture complete
[ERR] at org.apache.tools.ant.dispatch.DispatchUtils.execute(DispatchUtils.java:116)
[ERR] at org.apache.tools.ant.Task.perform(Task.java:348)
[ERR] at org.apache.tools.ant.taskdefs.Sequential.execute(Sequential.java:68)
[ERR] at org.apache.tools.ant.UnknownElement.execute(UnknownElement.java:291)
[ERR] at sun.reflect.GeneratedMethodAccessor9.invoke(Unknown Source)
[ERR] at sun.reflect.DelegatingMethodAccessorImpl.invoke(DelegatingMethodAccessorImpl.java:43)
[ERR] at java.lang.reflect.Method.invoke(Method.java:601)
[ERR] at org.apache.tools.ant.dispatch.DispatchUtils.execute(DispatchUtils.java:106)
[ERR] at org.apache.tools.ant.Task.perform(Task.java:348)
[ERR] at org.apache.tools.ant.taskdefs.MacroInstance.execute(MacroInstance.java:398)
[ERR] ... 68 more
[ERR] Caused by: com.sencha.exceptions.ExProcess: phantomjs process exited with code 139 :
[ERR] loading page resources/theme/default/theme.html
[ERR] capturing screenshot
[ERR] capturing widget location data
[ERR] widget capture complete
[ERR] at com.sencha.command.theme.ThemeCommands$CaptureCommand.execute(ThemeCommands.java:232)
[ERR] at com.sencha.command.theme.ThemeCommands$BuildCommand.execute(ThemeCommands.java:173)
[ERR] at sun.reflect.NativeMethodAccessorImpl.invoke0(Native Method)
[ERR] at sun.reflect.NativeMethodAccessorImpl.inv
[ERR] oke(NativeMethodAccessorImpl.java:57)
[ERR] at sun.reflect.DelegatingMethodAccessorImpl.invoke(DelegatingMethodAccessorImpl.java:43)
[ERR] at java.lang.reflect.Method.invoke(Method.java:601)
[ERR] at com.sencha.cli.Command.dispatch(Command.java:78)
[ERR] at com.sencha.cli.Commands.dispatch(Commands.java:49)
[ERR] at com.sencha.cli.Commands.dispatch(Commands.java:49)
[ERR] at com.sencha.cli.AbstractCommand.dispatch(AbstractCommand.java:182)
[ERR] at com.sencha.ant.SenchaCommandTask.doExecute(SenchaCommandTask.java:58)
[ERR] at com.sencha.ant.BaseAntTask.execute(BaseAntTask.java:22)
[ERR] at org.apache.tools.ant.UnknownElement.execute(UnknownElement.java:291)
[ERR] at sun.reflect.GeneratedMethodAccessor9.invoke(Unknown Source)
[ERR] at sun.reflect.DelegatingMethodAccessorImpl.invoke(DelegatingMethodAccessorImpl.java:43)
[ERR] at java.lang.reflect.Method.invoke(Method.java:601)
[ERR] at org.apache.tools.ant.dispatch.DispatchUtils.execute(DispatchUtils.java:106)
[ERR] ... 77 more
[ERR] Total time: 7 seconds
[ERR] com.sencha.exceptions.BasicException: The following error occurred while executing this line:
/home/phas/projects/Tesolevents/tesolevents/tesolepanel/.sencha/app/build-impl.xml:207: The following error occurred while executing this line:
/home/phas/projects/Tesolevents/tesolevents/tesolepanel/.sencha/app/build-impl.xml:213: com.sencha.exceptions.ExProcess: phantomjs process exited with code 139 :
loading page resources/theme/default/theme.html
capturing screenshot
capturing widget location data
widget capture complete

phas
20 Dec 2012, 6:00 AM
I solved it, apparently the provided phantomjs segfaulted when invoked, i simply sobstituted it with the one from http://phantomjs.org/

stahlman
28 Mar 2013, 11:24 AM
I get the same error, but substituting the exe from phantomjs.org didn't fix it... Several of my colleagues get this error as well. In their case, a Windows error dialog pops up indicating that phantomjs has terminated; then, the sencha build process seems to complete normally. I get no Windows error dialog; the build simply fails with lots of errors (as shown in OP).

Does anyone at Sencha know what's causing this and/or whether there's a workaround?