Sencha Cmd

Sencha is Hiring!

Working at Sencha means belonging to a growing group of brilliant people who are making it their mission to explore and enhance the possibilities of today’s web and mobile technologies. Why work at Sencha? We've got a couple of ideas…

Sencha is Hiring!
Page 57 of 116 FirstFirst ... 7 47 55 56 57 58 59 67 107 ... LastLast

+ Post New Thread

  1. Creating Workspace, Applications and Themes with Sencha Cmd Video - (3 Participants)

    You might be interested in this video:

    Started by jsakalos, 4 Aug 2013 4:24 AM
    • Replies: 5
    • Views: 2,288
    16 Aug 2013 2:24 AM Go to last post
  2. Sencha Cmd and JsDuck - (1 Participant)

    Salut, J'ai une suggestion. Je ne suis pas sûr que cela est techniquement possible. Pourquoi ne pas intégrer JsDuck, dans SenchaCmd pour générer...

    Started by sekaijin, 7 Aug 2013 1:20 AM
    • Replies: 2
    • Views: 899
    15 Aug 2013 11:37 PM Go to last post
  3. Sencha/3.1.2.342/phantomjs/phantom/bin/phantomjs: error while loading shared librarie - (2 Participants)

    slice: -before-slice: Capture theme image to /builds/wios-trunk/obj/timon/src/ui/theme-capture.png Jul 23, 2013 12:17:36 PM...

    Started by vipul.suthar, 23 Jul 2013 11:47 AM
    • Replies: 4
    • Views: 1,474
    14 Aug 2013 5:01 PM Go to last post
  4. Error in with Slicing images - (1 Participant)

    I use Sencha Cmd v3.1.2.342 + Ext js 4.2. The app genrate by the cmd can't build. sencha -sdk d:\tools\extjs\ext-4.2.0.663 generate app MyApp...

    Started by hustfyb, 23 May 2013 1:33 AM
    cmd 3.1.2.342
    • Replies: 2
    • Views: 1,436
    14 Aug 2013 2:48 PM Go to last post
  5. How to manage large project with sencha command? - (4 Participants)

    I see, the sencha command generate each and every apps independently with all required ext framework files and even more with only one theme...

    Started by prakashpaudel, 8 Mar 2013 1:22 AM
    • Replies: 5
    • Views: 1,502
    14 Aug 2013 1:36 AM Go to last post
  6. cmd v3.1.2.342 BUILD FAILED java.lang.NullPointerException - (4 Participants)

    I'm trying to do the theme-tutorial in the documentation, but after updating extjs to 4.2.1 and the cmd to 3.1.2.342 it got an BUILD FAILD err....

    Started by gallier, 30 Jun 2013 1:50 AM
    • Replies: 4
    • Views: 3,952
    13 Aug 2013 9:12 PM Go to last post
  7. sencha app watch endless loop - (1 Participant)

    Hello, I'm in the process of porting a very large Ext JS 4.1.2 application to 4.2.1, and I'd really like to use the new "app watch" feature to...

    Started by pbienick, 31 Jul 2013 6:32 AM
    • Replies: 6
    • Views: 1,910
    13 Aug 2013 10:05 AM Go to last post
  8. Question Test environment runs, production not - (1 Participant)

    Building my app in testing environment result in a good running app. The first screen is a logon screen with a dropdown and user username and...

    Started by winitsw, 7 Aug 2013 11:58 PM
    • Replies: 4
    • Views: 905
    12 Aug 2013 11:18 PM Go to last post
  9. sencha app build = PARRENTCLASS error (ExtJS 4.1) - (1 Participant)

    Hi i have some problem with sencha cmd tool, iam trying to build my app, and i get this error: adding implicit dependency for Ext.application...

    Started by Smeagol07, 10 Aug 2013 10:56 PM
    • Replies: 1
    • Views: 1,181
    12 Aug 2013 12:03 PM Go to last post
  10. Uncaught Error: [Ext.Loader] Failed loading synchronously via XHR: 'idgen/sequential. - (1 Participant)

    Hi, Scenario: I followed the steps to use the Sencha Cmd on a Sencha Architect MVC app. The application that has been build by the Architect...

    Started by iStan, 9 Aug 2013 5:15 AM
    • Replies: 1
    • Views: 2,936
    11 Aug 2013 3:53 PM Go to last post
  11. [CMD 4.0.0 beta 1] "sencha upgrade --beta" doesn't work - (1 Participant)

    I was on Sencha CMD 3.1.1.274 and tried upgrading to the 4.0.0 beta 1 by running: sencha upgrade --beta This didn't work as shown in the screenshot...

    Started by joostvanhassel, 7 Aug 2013 3:22 AM
    • Replies: 1
    • Views: 826
    11 Aug 2013 3:52 PM Go to last post
  12. sencha cmd proxy problem - (1 Participant)

    Hi, I have a problem with proxy in sencha cmd. I as under Windows XP with a proxy set via a proxy.pac. in chrome when I use the url:...

    Started by sekaijin, 7 Aug 2013 1:36 AM
    • Replies: 1
    • Views: 797
    11 Aug 2013 3:50 PM Go to last post
  13. Distributing app outside app store for ios - (1 Participant)

    Hi - is there a way to build/package a touch app and distribute outside of App Store? Thanks

    Started by nmorado, 9 Aug 2013 5:32 PM
    • Replies: 1
    • Views: 873
    10 Aug 2013 6:23 PM Go to last post
  14. How to add -before-build task to plugin.xml - (2 Participants)

    Hello, I would like to add a -before-build task to my .sencha/app/plugin.xml There is no documentation which tasks are supported (general...

    Started by Dumas, 25 Jul 2013 12:09 PM
    • Replies: 7
    • Views: 1,801
    9 Aug 2013 4:05 PM Go to last post
  15. com.sencha.exceptions.BasicException

    REQUIRED INFORMATION Sencha Cmd version(s) tested: Sencha Cmd 3.1.2.342 Operating System: Linux Mint 14 Nadia (Ubuntu) Framework used:

    Started by odibo, 8 Aug 2013 4:19 AM
    • Replies: 1
    • Views: 1,248
    9 Aug 2013 1:02 AM Go to last post
  16. Slicing complete - generated 0 images

    Hi, I cannot no more generate images with slicer. Command sencha app build generates the file build/project/production/theme-capture.json ,...

    Started by ludoo, 8 Aug 2013 1:37 AM
    slice
    • Replies: 1
    • Views: 790
    8 Aug 2013 7:53 AM Go to last post
  17. Question Generate and build sample app - (1 Participant)

    Hi, I build the sample app (ext-4.2.1.883) using the command 'sencha generate app MyFirstApp ..\..\MyFirstApp' Viewing this app in the browser...

    Started by winitsw, 5 Aug 2013 10:51 PM
    generate, skip.sass
    • Replies: 1
    • Views: 802
    7 Aug 2013 3:58 PM Go to last post
  18. PhantomJS crashes but still builds

    When the app is building at Capturing Theme Images, I'm getting a msg that PhantomJS.exe is crashing, but if I close the error window the build still...

    Started by juger, 7 Aug 2013 1:44 PM
    • Replies: 0
    • Views: 387
    7 Aug 2013 1:44 PM Go to last post
  19. Order in all-classes.js on app build is wrong - (1 Participant)

    In my EXT JS app, running `sencha compile concat -o build/all-classes.js` works just fine - it produces a functional build. However, running...

    Started by movys, 26 Jul 2013 7:23 AM
    • Replies: 5
    • Views: 1,224
    7 Aug 2013 1:17 PM Go to last post
  20. Sencha cmd build is failing continuously - (1 Participant)

    I am trying to build my code via Sencha cmd but every time it is failing and throwing same error. BUILD FAILED...

    Started by mk.ranjan, 5 Aug 2013 2:33 AM
    build failed, extjs 4.1.1a, java heap space, senchacmd 3.1.2
    • Replies: 3
    • Views: 1,090
    7 Aug 2013 12:06 PM Go to last post