1. #21
    Sencha Premium Member
    Join Date
    Feb 2012
    Posts
    270
    Answers
    3
    Vote Rating
    10
    worthlutz is on a distinguished road

      0  

    Default


    More follow up to this question:
    Quote Originally Posted by mitchellsimoens View Post
    Code:
    cd /path/to/sencha-touch-2.0.1 (or 2.0.0 if you don't have 2.0.1)
    sencha app create MyApp /path/to/MyApp
    cd /path/to/MyApp
    sencha app build native
    what does that get you?
    OS: windows 7 32bit
    created TestApp as described above
    Changed the packager.json to:
    Code:
    {    "applicationName":"MyTestApp",
        "applicationId":"com.jc.myTestAppID",
        "versionString":"0.1",
        "inputPath":"build/package/",
        "outputPath":"build/native/",
        "configuration":"Debug",
        "platform":"Android",
        "deviceType":"Universal",
        "iconName":"resources/icons/Icon.png",
        "sdkPath":"/android-sdks",
        "androidAPILevel":"15",
        "certificatePath":"\android\keys\firstkeystore",
        "certificateAlias":"firstkeystorealias",
        "orientations": [
            "portrait",
            "landscapeLeft",
            "landscapeRight",
            "portraitUpsideDown"
        ]
    }
    First error related to not finding "\Program Files\Java|jre\lib\tools.jar"
    I had to add a symlink to point to "\Program Files\Java|jdk1.6.0_32\lib\tools.jar" to fix this.

    Now I get it generating stuff until:
    Code:
    ...
    -pre-compile:
    
    -compile:
           [javac] Compiling 3 source files to E:\Sencha\projects\TestApp\build\native\bin\classes
    ""/android-sdks/tools/android" create project --target android-7 --name MyTestApp --activity STActivity --path "E:\sencha\projects\TestApp\build\native/" --package com.jc.myTestAppID"
    Could not run ant with error: 1
    Failed to package application
    [ERROR]
    E:\android-sdks\tools\ant\build.xml:651 The following error occurred while executing this line:
    E:\android-sdks\tools\ant\build.xml:672: Error running javac.exe compiler
    
    Total time: 1 second
    Any help on this?

    Worth

  2. #22
    Sencha Premium Member
    Join Date
    Feb 2012
    Posts
    270
    Answers
    3
    Vote Rating
    10
    worthlutz is on a distinguished road

      0  

    Default


    OK, now I think I have the set up fixed.


    I had to set variable JAVA_HOME to point to my Java jdk directory (C:\Program Files\Java\jdk1.6.0_32). As it was in "Program Files", I had to add a symlink "C:\java" to point to "C:\Program Files\Java" first and then use that.

    I now get my .apk file and it starts up in the emulator!!

    There is still are errors after the file is created . One is related to a txt file which is not deleted and caused an error related to "build/native" is not empty. I deleted this file as soon as I saw it created and then I get some unknow error at the end of the build. But the app is there.

    Now to try with a real app!!!

    Worth

  3. #23
    Sencha User
    Join Date
    Mar 2012
    Posts
    16
    Answers
    3
    Vote Rating
    0
    Don Pipo is on a distinguished road

      0  

    Default


    If I use

    Code:
    sencha app build native
    my app starts automatically in the iOSSimulator. Is it possible to get the same behaviour with

    Code:
    sencha package build -p packager.json
    ?

    I develop with Mac OS X 10.7. Thank you.

  4. #24
    Sencha User
    Join Date
    May 2012
    Posts
    1
    Vote Rating
    0
    abacus is on a distinguished road

      0  

    Default


    Thanks for the overview, dkamins, this seems to solve my problem (and clear my confusion!)

  5. #25
    Sencha User
    Join Date
    Jul 2012
    Posts
    1
    Vote Rating
    0
    malandro95 is on a distinguished road

      0  

    Default


    This needs to be shouted from the rooftops. This is major confusing with the the following instruction. Thanks dkamins!

    Quote Originally Posted by dkamins View Post
    This is the best solution I've gotten so far (thanks tareed for the pointers). AFAIK this is entirely using the "Sencha command" (i.e. the new one, not the old one from the SDK Tools).

    1. Start with the Sencha recommended app structure:
    Code:
    sencha generate app ...
    2. Write your app.

    3. If you have extra stuff that needs to go in your final app (beyond images, CSS, etc.), add the paths to the "extras" section of your "app.json" file.

    4. Create a "package" build, ("a self-contained, re-distributable production build that normally runs from local file system without the need for a web server"). This will appear in your ./build/package directory, and you should be able to run it directly with a WebKit browser. You can see exactly what will end up in your final native app (everything here). Note that this step does NOT use any of your packager.json files, which was part of my original issue with "sencha app build native".
    Code:
    sencha app build package
    5. Copy the default "packager.json" into e.g. "my_packager.json". Change "inputPath" from "build/native" to "build/package". You may create multiple JSON files with different options.

    6. Create a signed native packaged app from the package build you just made. This will create something like YourApp.app in the ./build directory. You can drag this file onto the iTunes icon to install it on your device. (You'll have to set up all kinds of wacky certificate/provisioning stuff to do this step, but that's beyond the scope of this thread.)
    Code:
    sencha package build -p my_packager.json
    7. If you made multiple packager JSON files, you can specify any of them in the -p argument, so you could have one that builds for the Simulator, one that makes a Debug build, another Release build, etc. etc. You could also do `sencha app build testing` and have a separate JSON with inputPath that pulls from testing instead, but not sure how useful that would be.

    I hope this helps somebody. Feedback is welcome. As mitchellsimoens shared, if you just want a quick and easy native app build that opens in the Simulator, you can just run `sencha app build native`, but this has some limitations like requiring you to use the single "packager.json" file and popping up the Simulator UI which you might not want.

  6. #26
    Sencha User
    Join Date
    Jul 2012
    Location
    Bangalore
    Posts
    113
    Vote Rating
    0
    kramprabhu is on a distinguished road

      0  

    Default


    Yes dkamins.. the secha docs is totally confusing.. there is not clear cut work flow for creating native application for devices. Do you got any solution for yourself?

  7. #27
    Sencha User
    Join Date
    Nov 2011
    Posts
    2
    Vote Rating
    0
    algone is on a distinguished road

      0  

    Default packaging using Sencha CMD 3 is not working

    packaging using Sencha CMD 3 is not working


    Hello Guys,
    Am new to Sencha and am just wiping up my first app. I managed to set up an app and tried it on the browser, now when I tried to package it, I got the following errors.
    operable program or batch file.
    [INF] [shellscript]
    [INF] [shellscript] '''compass''' is not recognized as an internal or external command,C:\Users\moss\Documents\NetBeansProjects\testapp\src\main\webapp\testapp\resources\sass>compass compile --boring --force
    [INF] [shellscript]
    [INF] [shellscript] operable program or batch file.
    [ERR] BUILD FAILED
    [ERR] com.sencha.exceptions.BasicException: The following error occurred while executing this line:
    [ERR] C:\Users\moss\Documents\NetBeansProjects\testapp\src\main\webapp\testapp\.sencha\app\build-impl.xml:92: The following error occurred while executing this line:
    [ERR] jar:file:/C:/Users/moss/bin/Sencha/Cmd/3.0.0.250/sencha.jar!/com/sencha/ant/antlib.xml:347: shellscript returned: 1
    [ERR] at com.sencha.exceptions.BasicException.wrap(BasicException.java:43)
    [ERR] at com.sencha.cli.Command.dispatch(Command.java:104)
    [ERR] at com.sencha.cli.Commands.dispatch(Commands.java:49)
    [ERR] at com.sencha.cli.AbstractCommand.dispatch(AbstractCommand.java:182)
    [ERR] at com.sencha.ant.SenchaCommandTask.doExecute(SenchaCommandTask.java:58)
    [ERR] at com.sencha.ant.BaseAntTask.execute(BaseAntTask.java:22)
    [ERR] at org.apache.tools.ant.UnknownElement.execute(UnknownElement.java:291)
    [ERR] at sun.reflect.NativeMethodAccessorImpl.invoke0(Native Method)
    [ERR] at sun.reflect.NativeMethodAccessorImpl.invoke(Unknown Source)
    [ERR] at sun.reflect.DelegatingMethodAccessorImpl.invoke(Unknown Source)
    [ERR] at java.lang.reflect.Method.invoke(Unknown Source)
    [ERR] at org.apache.tools.ant.dispatch.DispatchUtils.execute(DispatchUtils.java:106)
    [ERR] at org.apache.tools.ant.Task.perform(Task.java:348)
    [ERR] at org.apache.tools.ant.Target.execute(Target.java:392)
    [ERR] at org.apache.tools.ant.Target.performTasks(Target.java:413)
    [ERR] at org.apache.tools.ant.Project.executeSortedTargets(Project.java:1399)
    [ERR] at org.apache.tools.ant.Project.executeTarget(Project.java:1368)
    [ERR] at org.apache.tools.ant.helper.DefaultExecutor.executeTargets(DefaultExecutor.java:41)
    [ERR] at org.apache.tools.ant.Project.executeTargets(Project.java:1251)
    [ERR] at com.sencha.ant.AntRunner.run(AntRunner.java:156)
    [ERR] at com.sencha.ant.AntRunner.run(AntRunner.java:72)
    [ERR] at com.sencha.command.BasePluginCommands$BasePluginCommand.run(BasePluginCommands.java:87)
    [ERR] at com.sencha.command.BasePluginCommands$BasePluginCommand.run(BasePluginCommands.java:91)
    [ERR] at com.sencha.command.BasePluginCommands$BaseNamePathCommand.run(BasePluginCommands.java:135)
    [ERR] at com.sencha.command.app.AppCommands$BuildCommand.execute(AppCommands.java:106)
    [ERR] at sun.reflect.NativeMethodAccessorImpl.invoke0(Native Method)
    [ERR] at sun.reflect.NativeMethodAccessorImpl.invoke(Unknown Source)
    [ERR] at sun.reflect.DelegatingMethodAccessorImpl.invoke(Unknown Source)
    [ERR] at java.lang.reflect.Method.invoke(Unknown Source)
    [ERR] at com.sencha.cli.Command.dispatch(Command.java:78)
    [ERR] at com.sencha.cli.Commands.dispatch(Commands.java:49)
    [ERR] at com.sencha.cli.Commands.dispatch(Commands.java:49)
    [ERR] at com.sencha.command.Sencha.main(Sencha.java:71)
    [ERR] Caused by: C:\Users\moss\Documents\NetBeansProjects\testapp\src\main\webapp\testapp\.sencha\app\build-impl.xml:100: The following error occurred while executing this line:
    [ERR] C:\Users\moss\Documents\NetBeansProjects\testapp\src\main\webapp\testapp\.sencha\app\build-impl.xml:92: The following error occurred while executing this line:
    [ERR] jar:file:/C:/Users/moss/bin/Sencha/Cmd/3.0.0.250/sencha.jar!/com/sencha/ant/antlib.xml:347: shellscript returned: 1
    [ERR] at org.apache.tools.ant.ProjectHelper.addLocationToBuildException(ProjectHelper.java:551)
    [ERR] at org.apache.tools.ant.taskdefs.Ant.execute(Ant.java:444)
    [ERR] at org.apache.tools.ant.taskdefs.CallTarget.execute(CallTarget.java:105)
    [ERR] at org.apache.tools.ant.UnknownElement.execute(UnknownElement.java:291)
    [ERR] at sun.reflect.GeneratedMethodAccessor8.invoke(Unknown Source)
    [ERR] at sun.reflect.DelegatingMethodAccessorImpl.invoke(Unknown Source)
    [ERR] at java.lang.reflect.Method.invoke(Unknown Source)
    [ERR] at org.apache.tools.ant.dispatch.DispatchUtils.execute(DispatchUtils.java:106)
    [ERR] at org.apache.tools.ant.Task.perform(Task.java:348)
    [ERR] at org.apache.tools.ant.Target.execute(Target.java:392)
    [ERR] at org.apache.tools.ant.Target.performTasks(Target.java:413)
    [ERR] at org.apache.tools.ant.Project.executeSortedTargets(Project.java:1399)
    [ERR] at org.apache.tools.ant.Project.executeTarget(Project.java:1368)
    [ERR] at org.apache.tools.ant.helper.DefaultExecutor.executeTargets(DefaultExecutor.java:41)
    [ERR] at org.apache.tools.ant.Project.executeTargets(Project.java:1251)
    [ERR] at com.sencha.ant.AntRunner.run(AntRunner.java:156)
    [ERR] at com.sencha.ant.AntRunner.run(AntRunner.java:80)
    [ERR] at com.sencha.command.ant.AntCommand.execute(AntCommand.java:75)
    [ERR] at sun.reflect.NativeMethodAccessorImpl.invoke0(Native Method)
    [ERR] at sun.reflect.NativeMethodAccessorImpl.invoke(Unknown Source)
    [ERR] at sun.reflect.DelegatingMethodAccessorImpl.invoke(Unknown Source)
    [ERR] at java.lang.reflect.Method.invoke(Unknown Source)
    [ERR] at com.sencha.cli.Command.dispatch(Command.java:78)
    [ERR] ... 31 more
    [ERR] Caused by: C:\Users\moss\Documents\NetBeansProjects\testapp\src\main\webapp\testapp\.sencha\app\build-impl.xml:92: The following error occurred while executing this line:
    [ERR] jar:file:/C:/Users/moss/bin/Sencha/Cmd/3.0.0.250/sencha.jar!/com/sencha/ant/antlib.xml:347: shellscript returned: 1
    [ERR] at org.apache.tools.ant.ProjectHelper.addLocationToBuildException(ProjectHelper.java:551)
    [ERR] at org.apache.tools.ant.taskdefs.MacroInstance.execute(MacroInstance.java:401)
    [ERR] at org.apache.tools.ant.UnknownElement.execute(UnknownElement.java:291)
    [ERR] at sun.reflect.GeneratedMethodAccessor8.invoke(Unknown Source)
    [ERR] at sun.reflect.DelegatingMethodAccessorImpl.invoke(Unknown Source)
    [ERR] at java.lang.reflect.Method.invoke(Unknown Source)
    [ERR] at org.apache.tools.ant.dispatch.DispatchUtils.execute(DispatchUtils.java:106)
    [ERR] at org.apache.tools.ant.Task.perform(Task.java:348)
    [ERR] at org.apache.tools.ant.Target.execute(Target.java:392)
    [ERR] at org.apache.tools.ant.Target.performTasks(Target.java:413)
    [ERR] at org.apache.tools.ant.Project.executeSortedTargets(Project.java:1399)
    [ERR] at org.apache.tools.ant.helper.SingleCheckExecutor.executeTargets(SingleCheckExecutor.java:38)
    [ERR] at org.apache.tools.ant.Project.executeTargets(Project.java:1251)
    [ERR] at org.apache.tools.ant.taskdefs.Ant.execute(Ant.java:442)
    [ERR] ... 52 more

    what am I doing wrong?
    Am on WIN7, and using touch 2.1

    Thanks

  8. #28
    Sencha Premium Member
    Join Date
    Feb 2012
    Posts
    270
    Answers
    3
    Vote Rating
    10
    worthlutz is on a distinguished road

      0  

    Default


    Quote Originally Posted by algone View Post
    ...
    I got the following errors.
    operable program or batch file.
    [INF] [shellscript]
    [INF] [shellscript] '''compass''' is not recognized as an internal or external command,C:\Users\moss\Documents\NetBeansProjects\testapp\src\main\webapp\testapp\resources\sass>compass compile --boring --force
    [INF] [shellscript]
    [INF] [shellscript] operable program or batch file.
    [ERR] BUILD FAILED
    ...
    It appears that compass is not installed or not installed correctly. I'm using Ubuntu so cannot help you with Windows.

    Worth

  9. #29
    Sencha User
    Join Date
    Nov 2011
    Posts
    2
    Vote Rating
    0
    algone is on a distinguished road

      0  

    Default


    Well I installed compass and I still got error that it is not installed. So I followed the instruction in this link and changed the configurations accordingly. Now there are no issues with compass, but the java error still persists.

    C:\Users\moss\Documents\NetBeansProjects\testapp\src\main\webapp\testapp>sencha app build package
    Sencha Cmd v3.0.0.250
    [INF] init-properties:
    [INF] init-sencha-command:
    [INF] init:
    [INF] -before-app-build:
    [INF] app-build-impl:
    [INF] package:
    [INF] -before-init-local:
    [INF] -init-local:
    [INF] -after-init-local:
    [INF] init-local:
    [INF] find-cmd:
    [INF] -before-init:
    [INF] -init:
    [INF] -after-init:
    [INF] init:
    [INF] -before-build:
    [INF] sass:
    [INF] page:
    [INF] -before-page:
    [INF] -page:
    [INF] building application
    [INF] Deploying your application to C:\Users\moss\Documents\NetBeansProjects\testapp\src\main\webapp\testapp\build\MyApp\package
    [INF] Copied app.js
    [INF] Copied resources/css/app.css
    [INF] Copied C:\Users\moss\Documents\NetBeansProjects\testapp\src\main\webapp\testapp\resources\icons
    [INF] Copied C:\Users\moss\Documents\NetBeansProjects\testapp\src\main\webapp\testapp\resources\startup
    [INF] Resolving your application dependencies (http://localhost:8084/testapp/testapp/index.html)
    [INF] Compiling app.js and dependencies
    [INF] Processing classPath entry : C:\Users\moss\Documents\NetBeansProjects\testapp\src\main\webapp\testapp\sencha-compile-temp-dir
    [INF] Processing classPath entry : C:\Users\moss\Documents\NetBeansProjects\testapp\src\main\webapp\testapp\touch\src
    [INF] Processing classPath entry : C:\Users\moss\Documents\NetBeansProjects\testapp\src\main\webapp\testapp\app.js
    [INF] Processing classPath entry : C:\Users\moss\Documents\NetBeansProjects\testapp\src\main\webapp\testapp\app
    [ERR] def was null
    [ERR] failed to find meta class definition for name MyApp.view.Main
    [ERR] BUILD FAILED
    [ERR] com.sencha.exceptions.BasicException: The following error occurred while executing this line:
    [ERR] C:\Users\moss\Documents\NetBeansProjects\testapp\src\main\webapp\testapp\.sencha\app\build-impl.xml:120: javax.script.ScriptException: sun.org.mozilla.javascript.internal.WrappedException: Wrapped com.sencha.exceptions.BasicException: java.lang.NullPointerException (<Unknown source>#461) in <Unknown source> at line number 461
    [ERR] at com.sencha.exceptions.BasicException.wrap(BasicException.java:43)
    [ERR] at com.sencha.cli.Command.dispatch(Command.java:104)
    [ERR] at com.sencha.cli.Commands.dispatch(Commands.java:49)
    [ERR] at com.sencha.cli.AbstractCommand.dispatch(AbstractCommand.java:182)
    [ERR] at com.sencha.ant.SenchaCommandTask.doExecute(SenchaCommandTask.java:58)
    [ERR] at com.sencha.ant.BaseAntTask.execute(BaseAntTask.java:22)
    [ERR] at org.apache.tools.ant.UnknownElement.execute(UnknownElement.java:291)
    [ERR] at sun.reflect.NativeMethodAccessorImpl.invoke0(Native Method)
    [ERR] at sun.reflect.NativeMethodAccessorImpl.invoke(Unknown Source)
    [ERR] at sun.reflect.DelegatingMethodAccessorImpl.invoke(Unknown Source)
    [ERR] at java.lang.reflect.Method.invoke(Unknown Source)
    [ERR] at org.apache.tools.ant.dispatch.DispatchUtils.execute(DispatchUtils.java:106)
    [ERR] at org.apache.tools.ant.Task.perform(Task.java:348)
    [ERR] at org.apache.tools.ant.Target.execute(Target.java:392)
    [ERR] at org.apache.tools.ant.Target.performTasks(Target.java:413)
    [ERR] at org.apache.tools.ant.Project.executeSortedTargets(Project.java:1399)
    [ERR] at org.apache.tools.ant.Project.executeTarget(Project.java:1368)
    [ERR] at org.apache.tools.ant.helper.DefaultExecutor.executeTargets(DefaultExecutor.java:41)
    [ERR] at org.apache.tools.ant.Project.executeTargets(Project.java:1251)
    [ERR] at com.sencha.ant.AntRunner.run(AntRunner.java:156)
    [ERR] at com.sencha.ant.AntRunner.run(AntRunner.java:72)
    [ERR] at com.sencha.command.BasePluginCommands$BasePluginCommand.run(BasePluginCommands.java:87)
    [ERR] at com.sencha.command.BasePluginCommands$BasePluginCommand.run(BasePluginCommands.java:91)
    [ERR] at com.sencha.command.BasePluginCommands$BaseNamePathCommand.run(BasePluginCommands.java:135)
    [ERR] at com.sencha.command.app.AppCommands$BuildCommand.execute(AppCommands.java:106)
    [ERR] at sun.reflect.NativeMethodAccessorImpl.invoke0(Native Method)
    [ERR] at sun.reflect.NativeMethodAccessorImpl.invoke(Unknown Source)
    [ERR] at sun.reflect.DelegatingMethodAccessorImpl.invoke(Unknown Source)
    [ERR] at java.lang.reflect.Method.invoke(Unknown Source)
    [ERR] at com.sencha.cli.Command.dispatch(Command.java:78)
    [ERR] at com.sencha.cli.Commands.dispatch(Commands.java:49)
    [ERR] at com.sencha.cli.Commands.dispatch(Commands.java:49)
    [ERR] at com.sencha.command.Sencha.main(Sencha.java:71)
    [ERR] Caused by: C:\Users\moss\Documents\NetBeansProjects\testapp\src\main\webapp\testapp\.sencha\app\build-impl.xml:126: The following error occurred while executing this line:
    [ERR] C:\Users\moss\Documents\NetBeansProjects\testapp\src\main\webapp\testapp\.sencha\app\build-impl.xml:120: javax.script.ScriptException: sun.org.mozilla.javascript.internal.WrappedException: Wrapped com.sencha.exceptions.BasicException: java.lang.NullPointerException (<Unknown source>#461) in <Unknown source> at line number 461
    [ERR] at org.apache.tools.ant.ProjectHelper.addLocationToBuildException(ProjectHelper.java:551)
    [ERR] at org.apache.tools.ant.taskdefs.Ant.execute(Ant.java:444)
    [ERR] at org.apache.tools.ant.taskdefs.CallTarget.execute(CallTarget.java:105)
    [ERR] at org.apache.tools.ant.UnknownElement.execute(UnknownElement.java:291)
    [ERR] at sun.reflect.GeneratedMethodAccessor8.invoke(Unknown Source)
    [ERR] at sun.reflect.DelegatingMethodAccessorImpl.invoke(Unknown Source)
    [ERR] at java.lang.reflect.Method.invoke(Unknown Source)
    [ERR] at org.apache.tools.ant.dispatch.DispatchUtils.execute(DispatchUtils.java:106)
    [ERR] at org.apache.tools.ant.Task.perform(Task.java:348)
    [ERR] at org.apache.tools.ant.Target.execute(Target.java:392)
    [ERR] at org.apache.tools.ant.Target.performTasks(Target.java:413)
    [ERR] at org.apache.tools.ant.Project.executeSortedTargets(Project.java:1399)
    [ERR] at org.apache.tools.ant.Project.executeTarget(Project.java:1368)
    [ERR] at org.apache.tools.ant.helper.DefaultExecutor.executeTargets(DefaultExecutor.java:41)
    [ERR] at org.apache.tools.ant.Project.executeTargets(Project.java:1251)
    [ERR] at com.sencha.ant.AntRunner.run(AntRunner.java:156)
    [ERR] at com.sencha.ant.AntRunner.run(AntRunner.java:80)
    [ERR] at com.sencha.command.ant.AntCommand.execute(AntCommand.java:75)
    [ERR] at sun.reflect.NativeMethodAccessorImpl.invoke0(Native Method)
    [ERR] at sun.reflect.NativeMethodAccessorImpl.invoke(Unknown Source)
    [ERR] at sun.reflect.DelegatingMethodAccessorImpl.invoke(Unknown Source)
    [ERR] at java.lang.reflect.Method.invoke(Unknown Source)
    [ERR] at com.sencha.cli.Command.dispatch(Command.java:78)
    [ERR] ... 31 more
    [ERR] Caused by: C:\Users\moss\Documents\NetBeansProjects\testapp\src\main\webapp\testapp\.sencha\app\build-impl.xml:120: javax.script.ScriptException: sun.org.mozilla.javascript.internal.WrappedException: Wrapped com.sencha.exceptions.BasicException: java.lang.NullPointerException (<Unknown source>#461) in <Unknown source> at line number 461
    [ERR] at org.apache.tools.ant.util.ReflectUtil.toBuildException(ReflectUtil.java:183)
    [ERR] at org.apache.tools.ant.util.ReflectUtil.throwBuildException(ReflectUtil.java:166)
    [ERR] at org.apache.tools.ant.util.ReflectUtil.invoke(ReflectUtil.java:110)
    [ERR] at org.apache.tools.ant.util.ReflectWrapper.invoke(ReflectWrapper.java:81)
    [ERR] at org.apache.tools.ant.util.optional.JavaxScriptRunner.evaluateScript(JavaxScriptRunner.java:103)
    [ERR] at org.apache.tools.ant.util.optional.JavaxScriptRunner.executeScript(JavaxScriptRunner.java:67)
    [ERR] at org.apache.tools.ant.taskdefs.optional.script.ScriptDef.executeScript(ScriptDef.java:350)
    [ERR] at org.apache.tools.ant.taskdefs.optional.script.ScriptDefBase.execute(ScriptDefBase.java:50)
    [ERR] at org.apache.tools.ant.UnknownElement.execute(UnknownElement.java:291)
    [ERR] at sun.reflect.GeneratedMethodAccessor8.invoke(Unknown Source)
    [ERR] at sun.reflect.DelegatingMethodAccessorImpl.invoke(Unknown Source)
    [ERR] at java.lang.reflect.Method.invoke(Unknown Source)
    [ERR] at org.apache.tools.ant.dispatch.DispatchUtils.execute(DispatchUtils.java:106)
    [ERR] at org.apache.tools.ant.Task.perform(Task.java:348)
    [ERR] at org.apache.tools.ant.Target.execute(Target.java:392)
    [ERR] at org.apache.tools.ant.Target.performTasks(Target.java:413)
    [ERR] at org.apache.tools.ant.Project.executeSortedTargets(Project.java:1399)
    [ERR] at org.apache.tools.ant.helper.SingleCheckExecutor.executeTargets(SingleCheckExecutor.java:38)
    [ERR] at org.apache.tools.ant.Project.executeTargets(Project.java:1251)
    [ERR] at org.apache.tools.ant.taskdefs.Ant.execute(Ant.java:442)
    [ERR] ... 52 more
    [ERR] Caused by: javax.script.ScriptException: sun.org.mozilla.javascript.internal.WrappedException: Wrapped com.sencha.exceptions.BasicException: java.lang.NullPointerException (<Unknown source>#461) in <Unknown source> at line number 461
    [ERR] at com.sun.script.javascript.RhinoScriptEngine.eval(Unknown Source)
    [ERR] at com.sun.script.javascript.RhinoScriptEngine.eval(Unknown Source)
    [ERR] at javax.script.AbstractScriptEngine.eval(Unknown Source)
    [ERR] at sun.reflect.NativeMethodAccessorImpl.invoke0(Native Method)
    [ERR] at sun.reflect.NativeMethodAccessorImpl.invoke(Unknown Source)
    [ERR] at sun.reflect.DelegatingMethodAccessorImpl.invoke(Unknown Source)
    [ERR] at java.lang.reflect.Method.invoke(Unknown Source)
    [ERR] at org.apache.tools.ant.util.ReflectUtil.invoke(ReflectUtil.java:108)
    [ERR] ... 69 more
    [ERR] Caused by: sun.org.mozilla.javascript.internal.WrappedException: Wrapped com.sencha.exceptions.BasicException: java.lang.NullPointerException (<Unknown source>#461)
    [ERR] at sun.org.mozilla.javascript.internal.Context.throwAsScriptRuntimeEx(Unknown Source)
    [ERR] at sun.org.mozilla.javascript.internal.MemberBox.invoke(Unknown Source)
    [ERR] at sun.org.mozilla.javascript.internal.NativeJavaMethod.call(Unknown Source)
    [ERR] at sun.org.mozilla.javascript.internal.Interpreter.interpretLoop(Unknown Source)
    [ERR] at sun.org.mozilla.javascript.internal.Interpreter.interpret(Unknown Source)
    [ERR] at sun.org.mozilla.javascript.internal.InterpretedFunction.call(Unknown Source)
    [ERR] at sun.org.mozilla.javascript.internal.ContextFactory.doTopCall(Unknown Source)
    [ERR] at com.sun.script.javascript.RhinoScriptEngine$1.superDoTopCall(Unknown Source)
    [ERR] at com.sun.script.javascript.RhinoS
    [ERR] criptEngine$1.doTopCall(Unknown Source)
    [ERR] at sun.org.mozilla.javascript.internal.ScriptRuntime.doTopCall(Unknown Source)
    [ERR] at sun.org.mozilla.javascript.internal.InterpretedFunction.exec(Unknown Source)
    [ERR] at sun.org.mozilla.javascript.internal.Context.evaluateReader(Unknown Source)
    [ERR] ... 77 more
    [ERR] Caused by: com.sencha.exceptions.BasicException: java.lang.NullPointerException
    [ERR] at com.sencha.cli.Commands$Cmd.create(Commands.java:117)
    [ERR] at com.sencha.cli.Commands.findCommand(Commands.java:74)
    [ERR] at com.sencha.cli.Commands.dispatch(Commands.java:43)
    [ERR] at com.sencha.cli.Commands.dispatch(Commands.java:49)
    [ERR] at com.sencha.cli.AbstractCommand.dispatch(AbstractCommand.java:182)
    [ERR] at sun.reflect.NativeMethodAccessorImpl.invoke0(Native Method)
    [ERR] at sun.reflect.NativeMethodAccessorImpl.invoke(Unknown Source)
    [ERR] at sun.reflect.DelegatingMethodAccessorImpl.invoke(Unknown Source)
    [ERR] at java.lang.reflect.Method.invoke(Unknown Source)
    [ERR] ... 88 more
    [ERR] Caused by: java.lang.NullPointerException
    [ERR] at com.sencha.tools.compiler.MetaClassDefinition.addImplicitRequirement(MetaClassDefinition.java:504)
    [ERR] at com.sencha.tools.compiler.MetaClassDefinition.resolveImplicitDependencies(MetaClassDefinition.java:752)
    [ERR] at com.sencha.tools.compiler.MetaClassDefinition.resolveImplicitDependencies(MetaClassDefinition.java:763)
    [ERR] at com.sencha.tools.compiler.MetaClassDefinition.resolveImplicitDependencies(MetaClassDefinition.java:763)
    [ERR] at com.sencha.tools.compiler.MetaClassDefinition.resolveImplicitDependencies(MetaClassDefinition.java:832)
    [ERR] at com.sencha.tools.compiler.MetaClassDefinition.resolveImplicitDependencies(MetaClassDefinition.java:859)
    [ERR] at com.sencha.tools.compiler.sources.SourceFileCache.resolveImplicitDependencies(SourceFileCache.java:480)
    [ERR] at com.sencha.command.compile.CompileCommands.getCache(CompileCommands.java:198)
    [ERR] at com.sencha.command.compile.CompileCommands.getCache(CompileCommands.java:154)
    [ERR] at com.sencha.command.compile.CompileCommands$BaseFilterCommand.<init>(CompileCommands.java:300)
    [ERR] at com.sencha.command.compile.CompileCommands$IncludeCommand.<init>(CompileCommands.java:420)
    [ERR] at com.sencha.command.compile.CompileCommands$UnionCommand.<init>(CompileCommands.java:425)
    [ERR] at com.sencha.command.compile.CompileCommands.createUnion(CompileCommands.java:1068)
    [ERR] at sun.reflect.NativeMethodAccessorImpl.invoke0(Native Method)
    [ERR] at sun.reflect.NativeMethodAccessorImpl.invoke(Unknown Source)
    [ERR] at sun.reflect.DelegatingMethodAccessorImpl.invoke(Unknown Source)
    [ERR] at java.lang.reflect.Method.invoke(Unknown Source)
    [ERR] at com.sencha.cli.Commands$Cmd.create(Commands.java:99)
    [ERR] ... 96 more
    [ERR] Total time: 4 seconds
    [ERR] com.sencha.exceptions.BasicException: The following error occurred while executing this line:
    C:\Users\moss\Documents\NetBeansProjects\testapp\src\main\webapp\testapp\.sencha\app\build-impl.xml:120: javax.script.ScriptException: sun.org.mozilla.javascript.internal.WrappedException: Wrapped com.sencha.exceptions.BasicException: java.lang.NullPointerException (<Unknown source>#461) in <Unknown source> at line number 461

Turkiyenin en sevilen filmlerinin yer aldigi xnxx internet sitemiz olan ve porn sex tarzi bir site olan mobil porno izle sitemiz gercekten dillere destan bir durumda herkesin sevdigi bir site olarak tarihe gececege benziyor. Sitenin en belirgin ozelliklerinden birisi de Turkiyede gercekten kaliteli ve muntazam, duzenli porno izle siteleri olmamasidir. Bu yuzden iste. Ayrica en net goruntu kalitesine sahip adresinde yayinlanmaktadir. Mesela diğer sitelerimizden bahsedecek olursak, en iyi hd porno video arşivine sahip bir siteyiz. "The Best anal porn videos and slut anus, big asses movies set..." hd porno faketaxi