I have these following bug when i try to build the app using sencha cmd v3 , any idea?

Code:
[ERROR]		def was null
[ERROR]		failed to find meta class definition for name proxy.sqlitestorage
[ERROR]		BUILD FAILED
[ERROR]		com.sencha.exceptions.BasicException: