Thank you for reporting this bug. We will make it our priority to review this report.
  1. #1
    Sencha User
    Join Date
    Jan 2013
    Posts
    9
    Vote Rating
    2
    T.Wen is on a distinguished road

      0  

    Default Version 2.1.0 Build 678 package app error with Sencha Cmd v3.0.2.288

    Version 2.1.0 Build 678 package app error with Sencha Cmd v3.0.2.288


    Version 2.1.0 Build 678 works fine with&nbsp;Sencha Cmd v3.0.2.255 when using the Package-&gt;build command from the UI. After updating Sencha Cmd to v3.0.2.288, the package command changed from "sencha package" to "sencha app package". The Architect, however, still invoke the old "sencha package build packager.json" command, which resulted the error message: "[ERR] &nbsp; &nbsp; &nbsp; &nbsp; &nbsp; The package command has moved to 'sencha app package'."<br><br>Is there a Config file in Architect that can be updated by end user to use the correct package command? or I need to wait for a updated version of Architect?

  2. #2
    Sencha - Architect Dev Team Phil.Strong's Avatar
    Join Date
    Mar 2007
    Location
    Baltimore, MD
    Posts
    1,733
    Vote Rating
    51
    Phil.Strong is a jewel in the rough Phil.Strong is a jewel in the rough Phil.Strong is a jewel in the rough Phil.Strong is a jewel in the rough

      0  

    Default


    Architect 2.1 will only support Cmd 250 which is the latest released version (others are in beta).

    Architect 2.2 will be able to support multiple versions and will call the correct commands depending on the version you have installed.
    Phil Strong
    @philstrong
    #SenchaArchitect
    Sencha Architect Development Team

  3. #3
    Sencha User
    Join Date
    Feb 2013
    Posts
    7
    Vote Rating
    1
    fkollmann is on a distinguished road

      0  

    Default


    Where can I get Cmd 250?

  4. #4
    Sencha Premium Member
    Join Date
    Apr 2012
    Location
    Lausanne, Switzerland
    Posts
    196
    Vote Rating
    1
    mcbl can only hope to improve

      0  

    Default


    Where?

  5. #5
    Sencha User
    Join Date
    Nov 2012
    Posts
    188
    Vote Rating
    16
    Gil Gordon will become famous soon enough

      0  

    Default Links for Cmd v3.0.0.250

    Links for Cmd v3.0.0.250


    Here:
    http://cdn.sencha.com/senchacmd/Senc...ux-x64.run.zip
    http://cdn.sencha.com/senchacmd/Senc...-linux.run.zip
    http://cdn.sencha.com/senchacmd/Senc...50-osx.app.zip
    http://cdn.sencha.com/senchacmd/SenchaCmd-3.0.0.250-windows.exe.zip

    The next version of Architect will work with the latest Cmd (sorry but I can not talk about exactly when that next version will release).

  6. #6
    Sencha User
    Join Date
    Mar 2013
    Posts
    3
    Vote Rating
    1
    thiemdp is on a distinguished road

      0  

    Default sencha cmd v3.0.2.288 Error command " sencha app build"

    sencha cmd v3.0.2.288 Error command " sencha app build"


    Code:
    D:\Customer>sencha app build native
    Sencha Cmd v3.0.2.288
    [INF]
    [INF]           init-properties:
    [INF]
    [INF]           init-sencha-command:
    [INF]
    [INF]           init:
    [INF]
    [INF]           -before-app-build:
    [INF]
    [INF]           app-build-impl:
    [INF]
    [INF]           native:
    [INF]
    [INF]           -before-init-local:
    [INF]
    [INF]           -init-local:
    [INF]
    [INF]           -after-init-local:
    [INF]
    [INF]           init-local:
    [INF]
    [INF]           find-cmd:
    [INF]
    [INF]           -before-init:
    [INF]
    [INF]           -init:
    [ERR]
    [ERR]           BUILD FAILED
    [ERR]           com.sencha.exceptions.BasicException: The ExtJS SDK currently su
    pports '''production''' and '''testing''' builds not native
    [ERR]                   at com.sencha.exceptions.BasicException.wrap(BasicExcept
    ion.java:43)
    [ERR]                   at com.sencha.cli.Command.dispatch(Command.java:104)
    [ERR]                   at com.sencha.cli.Commands.dispatch(Commands.java:49)
    [ERR]                   at com.sencha.cli.AbstractCommand.dispatch(AbstractComma
    nd.java:182)
    [ERR]                   at com.sencha.ant.SenchaCommandTask.doExecute(SenchaComm
    andTask.java:69)
    [ERR]                   at com.sencha.ant.BaseAntTask.execute(BaseAntTask.java:2
    2)
    [ERR]                   at org.apache.tools.ant.UnknownElement.execute(UnknownEl
    ement.java:291)
    [ERR]                   at sun.reflect.NativeMethodAccessorImpl.invoke0(Native M
    ethod)
    [ERR]                   at sun.reflect.NativeMethodAccessorImpl.invoke(Unknown S
    ource)
    [ERR]                   at sun.reflect.DelegatingMethodAccessorImpl.invoke(Unkno
    wn Source)
    [ERR]                   at java.lang.reflect.Method.invoke(Unknown Source)
    [ERR]                   at org.apache.tools.ant.dispatch.DispatchUtils.execute(D
    ispatchUtils.java:106)
    [ERR]                   at org.apache.tools.ant.Task.perform(Task.java:348)
    [ERR]                   at org.apache.tools.ant.Target.execute(Target.java:392)
    [ERR]                   at org.apache.tools.ant.Target.performTasks(Target.java:
    413)
    [ERR]                   at org.apache.tools.ant.Project.executeSortedTargets(Pro
    ject.java:1399)
    [ERR]                   at org.apache.tools.ant.Project.executeTarget(Project.ja
    va:1368)
    [ERR]                   at org.apache.tools.ant.helper.DefaultExecutor.executeTa
    rgets(DefaultExecutor.java:41)
    [ERR]                   at org.apache.tools.ant.Project.executeTargets(Project.j
    ava:1251)
    [ERR]                   at com.sencha.ant.AntRunner.run(AntRunner.java:156)
    [ERR]                   at com.sencha.ant.AntRunner.run(AntRunner.java:72)
    [ERR]                   at com.sencha.command.BasePluginCommands$BasePluginComma
    nd.run(BasePluginCommands.java:94)
    [ERR]                   at com.sencha.command.BasePluginCommands$BasePluginComma
    nd.run(BasePluginCommands.java:98)
    [ERR]                   at com.sencha.command.BasePluginCommands$BaseNamePathCom
    mand.run(BasePluginCommands.java:142)
    [ERR]                   at com.sencha.command.app.AppCommands$BuildCommand.execu
    te(AppCommands.java:116)
    [ERR]                   at sun.reflect.NativeMethodAccessorImpl.invoke0(Native M
    ethod)
    [ERR]                   at sun.reflect.NativeMethodAccessorImpl.invoke(Unknown S
    ource)
    [ERR]                   at sun.reflect.DelegatingMethodAccessorImpl.invoke(Unkno
    wn Source)
    [ERR]                   at java.lang.reflect.Method.invoke(Unknown Source)
    [ERR]                   at com.sencha.cli.Command.dispatch(Command.java:78)
    [ERR]                   at com.sencha.cli.Commands.dispatch(Commands.java:49)
    [ERR]                   at com.sencha.cli.Commands.dispatch(Commands.java:49)
    [ERR]                   at com.sencha.command.Sencha.main(Sencha.java:71)
    [ERR]           Caused by: D:\Customer\.sencha\app\build-impl.xml:122: The ExtJS
     SDK currently supports '''production''' and '''testing''' builds not native
    [ERR]                   at org.apache.tools.ant.taskdefs.Exit.execute(Exit.java:
    164)
    [ERR]                   at org.apache.tools.ant.UnknownElement.execute(UnknownEl
    ement.java:291)
    [ERR]                   at sun.reflect.GeneratedMethodAccessor10.invoke(Unknown
    Source)
    [ERR]                   at sun.reflect.DelegatingMethodAccessorImpl.invoke(Unkno
    wn Source)
    [ERR]                   at java.lang.reflect.Method.invoke(Unknown Source)
    [ERR]                   at org.apache.tools.ant.dispatch.DispatchUtils.execute(D
    ispatchUtils.java:106)
    [ERR]                   at org.apache.tools.ant.Task.perform(Task.java:348)
    [ERR]                   at org.apache.tools.ant.taskdefs.Sequential.execute(Sequ
    ential.java:68)
    [ERR]                   at net.sf.antcontrib.logic.IfTask.execute(IfTask.java:21
    7)
    [ERR]                   at sun.reflect.NativeMethodAccessorImpl.invoke0(Native M
    ethod)
    [ERR]                   at sun.reflect.NativeMethodAccessorImpl.invoke(Unknown S
    ource)
    [ERR]                   at sun.reflect.DelegatingMethodAccessorImpl.invoke(Unkno
    wn Source)
    [ERR]                   at java.lang.reflect.Method.invoke(Unknown Source)
    [ERR]                   at org.apache.tools.ant.dispatch.DispatchUtils.execute(D
    ispatchUtils.java:106)
    [ERR]                   at org.apache.tools.ant.TaskAdapter.execute(TaskAdapter.
    java:154)
    [ERR]                   at org.apache.tools.ant.UnknownElement.execute(UnknownEl
    ement.java:291)
    [ERR]                   at sun.reflect.GeneratedMethodAccessor10.invoke(Unknown
    Source)
    [ERR]                   at sun.reflect.DelegatingMethodAccessorImpl.invoke(Unkno
    wn Source)
    [ERR]                   at java.lang.reflect.Method.invoke(Unknown Source)
    [ERR]                   at org.apache.tools.ant.dispatch.DispatchUtils.execute(D
    ispatchUtils.java:106)
    [ERR]                   at org.apache.tools.ant.Task.perform(Task.java:348)
    [ERR]                   at org.apache.tools.ant.taskdefs.Sequential.execute(Sequ
    ential.java:68)
    [ERR]                   at net.sf.antcontrib.logic.IfTask.execute(IfTask.java:21
    7)
    [ERR]                   at sun.reflect.NativeMethodAccessorImpl.invoke0(Native M
    ethod)
    [ERR]                   at sun.reflect.NativeMethodAccessorImpl.invoke(Unknown S
    ource)
    [ERR]                   at sun.reflect.DelegatingMethodAccessorImpl.invoke(Unkno
    wn Source)
    [ERR]                   at java.lang.reflect.Method.invoke(Unknown Source)
    [ERR]                   at org.apache.tools.ant.dispatch.DispatchUtils.execute(D
    ispatchUtils.java:106)
    [ERR]                   at org.apache.tools.ant.TaskAdapter.execute(TaskAdapter.
    java:154)
    [ERR]                   at org.apache.tools.ant.UnknownElement.execute(UnknownEl
    ement.java:291)
    [ERR]                   at sun.reflect.GeneratedMethodAccessor10.invoke(Unknown
    Source)
    [ERR]                   at sun.reflect.DelegatingMethodAccessorImpl.invoke(Unkno
    wn Source)
    [ERR]                   at java.lang.reflect.Method.invoke(Unknown Source)
    [ERR]                   at org.apache.tools.ant.dispatch.DispatchUtils.execute(D
    ispatchUtils.java:106)
    [ERR]                   at org.apache.tools.ant.Task.perform(Task.java:348)
    [ERR]                   at org.apache.tools.ant.Target.execute(Target.java:392)
    [ERR]                   at org.apache.tools.ant.Target.performTasks(Target.java:
    413)
    [ERR]                   at org.apache.tools.ant.Project.executeSortedTargets(Pro
    ject.java:1399)
    [ERR]                   at org.apache.tools.ant.Project.executeTarget(Project.ja
    va:1368)
    [ERR]                   at org.apache.tools.ant.helper.DefaultExecutor.executeTa
    rgets(DefaultExecutor.java:41)
    [ERR]                   at org.apache.tools.ant.Project.executeTargets(Project.j
    ava:1251)
    [ERR]                   at com.sencha.ant.AntRunner.run(AntRunner.java:156)
    [ERR]                   at com.sencha.ant.AntRunner.run(AntRunner.java:80)
    [ERR]                   at com.sencha.command.ant.AntCommand.execute(AntCommand.
    java:75)
    [ERR]                   at sun.reflect.NativeMethodAccessorImpl.invoke0(Native M
    ethod)
    [ERR]                   at sun.reflect.NativeMethodAccessorImpl.invoke(Unknown S
    ource)
    [ERR]                   at sun.reflect.DelegatingMethodAccessorImpl.invoke(Unkno
    wn Source)
    [ERR]                   at java.lang.reflect.Method.invoke(Unknown Source)
    [ERR]                   at com.sencha.cli.Command.dispatch(Command.java:78)
    [ERR]                   ... 31 more
    [ERR]
    [ERR]           Total time: 1 second
    [ERR]           com.sencha.exceptions.BasicException: The ExtJS SDK currently su
    pports 'production' and 'testing' builds not native
    
    D:\Customer>
    help me!
    thanks!
    -----------------
    thiemdp

  7. #7
    Sencha User
    Join Date
    Jan 2013
    Posts
    9
    Vote Rating
    2
    T.Wen is on a distinguished road

      1  

    Default extjs is for web and desktop builds, sencha touch is for mobile app

    extjs is for web and desktop builds, sencha touch is for mobile app


    the error shows you are building an app using extjs which is not for mobile application development. If you want to build an app that can run on mobile device, use sencha touch components.

film izle

hd film izle

film sitesi

takipci kazanma sitesi

takipci kazanma sitesi

güzel olan herşey

takipci alma sitesi

komik eğlenceli videolar