Gelmiş geçmiş en büyük porno sitemiz olan 2pe de her zaman en kaliteli pornoları sunmayı hedefledik. Diğer video sitemiz olan vuam da ise hd porno ağırlıklı çalışmalara başladık.

  1. #1
    Sencha User amarcos3032's Avatar
    Join Date
    Jan 2013
    Location
    Brasil
    Posts
    7
    Vote Rating
    0
    amarcos3032 is on a distinguished road

      0  

    Default Unanswered: Problems with BUILD FAILED

    Unanswered: Problems with BUILD FAILED


    Hello friends,


    Please help me!


    I'm having trouble with command BUILD.


    Running the comand:
    PHP Code:
    sencha app build -e native 
    The following error is displayed below:
    I've tried everything! I consulted the documentation and nothing.


    Please help me. Thank you.

    Result.

    Code:
    F:\Dropbox\www\MOBILE\toni2app>sencha app build -e nativeSencha Cmd v3.0.0.250
    [INF]           init-properties:
    [INF]           init-sencha-command:
    [INF]           init:
    [INF]           -before-app-build:
    [INF]           app-build-impl:
    [INF]           native:
    [INF]           -before-init-local:
    [INF]           -init-local:
    [INF]           -after-init-local:
    [INF]           init-local:
    [INF]           find-cmd:
    [INF]           -before-init:
    [INF]           -init:
    [INF]           -after-init:
    [INF]           init:
    [INF]           -before-build:
    [INF]           sass:
    [INF]           -before-sass:
    [INF]           -sass:
    [INF]           [shellscript]
    [INF]           [shellscript] F:\Dropbox\www\MOBILE\toni2app\resources\sass>comp
    ass compile --boring --force
    [INF]           [shellscript]     error app.scss (Line 23 of _button.scss: Undef
    ined variable: "$base-gradient".)
    [INF]           [shellscript] Sass::SyntaxError on line ["23"] of F: Undefined v
    ariable: "$base-gradient".
    [INF]           [shellscript] Run with --trace to see the full backtrace
    [ERR]           BUILD FAILED
    [ERR]           com.sencha.exceptions.BasicException: The following error occurr
    ed while executing this line:
    [ERR]           F:\Dropbox\www\MOBILE\toni2app\.sencha\app\build-impl.xml:92: Th
    e following error occurred while executing this line:
    [ERR]           jar:file:/C:/Users/AntonioMarcosP/bin/Sencha/Cmd/3.0.0.250/sench
    a.jar!/com/sencha/ant/antlib.xml:347: shellscript returned: 1
    [ERR]                   at com.sencha.exceptions.BasicException.wrap(BasicExcept
    ion.java:43)
    [ERR]                   at com.sencha.cli.Command.dispatch(Command.java:104)
    [ERR]                   at com.sencha.cli.Commands.dispatch(Commands.java:49)
    [ERR]                   at com.sencha.cli.AbstractCommand.dispatch(AbstractComma
    nd.java:182)
    [ERR]                   at com.sencha.ant.SenchaCommandTask.doExecute(SenchaComm
    andTask.java:58)
    [ERR]                   at com.sencha.ant.BaseAntTask.execute(BaseAntTask.java:2
    2)
    [ERR]                   at org.apache.tools.ant.UnknownElement.execute(UnknownEl
    ement.java:291)
    [ERR]                   at sun.reflect.NativeMethodAccessorImpl.invoke0(Native M
    ethod)
    [ERR]                   at sun.reflect.NativeMethodAccessorImpl.invoke(Unknown S
    ource)
    [ERR]                   at sun.reflect.DelegatingMethodAccessorImpl.invoke(Unkno
    wn Source)
    [ERR]                   at java.lang.reflect.Method.invoke(Unknown Source)
    [ERR]                   at org.apache.tools.ant.dispatch.DispatchUtils.execute(D
    ispatchUtils.java:106)
    [ERR]                   at org.apache.tools.ant.Task.perform(Task.java:348)
    [ERR]                   at org.apache.tools.ant.Target.execute(Target.java:392)
    [ERR]                   at org.apache.tools.ant.Target.performTasks(Target.java:
    413)
    [ERR]                   at org.apache.tools.ant.Project.executeSortedTargets(Pro
    ject.java:1399)
    [ERR]                   at org.apache.tools.ant.Project.executeTarget(Project.ja
    va:1368)
    [ERR]                   at org.apache.tools.ant.helper.DefaultExecutor.executeTa
    rgets(DefaultExecutor.java:41)
    [ERR]                   at org.apache.tools.ant.Project.executeTargets(Project.j
    ava:1251)
    [ERR]                   at com.sencha.ant.AntRunner.run(AntRunner.java:156)
    [ERR]                   at com.sencha.ant.AntRunner.run(AntRunner.java:72)
    [ERR]                   at com.sencha.command.BasePluginCommands$BasePluginComma
    nd.run(BasePluginCommands.java:87)
    [ERR]                   at com.sencha.command.BasePluginCommands$BasePluginComma
    nd.run(BasePluginCommands.java:91)
    [ERR]                   at com.sencha.command.BasePluginCommands$BaseNamePathCom
    mand.run(BasePluginCommands.java:135)
    [ERR]                   at com.sencha.command.app.AppCommands$BuildCommand.execu
    te(AppCommands.java:106)
    [ERR]                   at sun.reflect.NativeMethodAccessorImpl.invoke0(Native M
    ethod)
    [ERR]                   at sun.reflect.NativeMethodAccessorImpl.invoke(Unknown S
    ource)
    [ERR]                   at sun.reflect.DelegatingMethodAccessorImpl.invoke(Unkno
    wn Source)
    [ERR]                   at java.lang.reflect.Method.invoke(Unknown Source)
    [ERR]                   at com.sencha.cli.Command.dispatch(Command.java:78)
    [ERR]                   at com.sencha.cli.Commands.dispatch(Commands.java:49)
    [ERR]                   at com.sencha.cli.Commands.dispatch(Commands.java:49)
    [ERR]                   at com.sencha.command.Sencha.main(Sencha.java:71)
    [ERR]           Caused by: F:\Dropbox\www\MOBILE\toni2app\.sencha\app\build-impl
    .xml:100: The following error occurred while executing this line:
    [ERR]           F:\Dropbox\www\MOBILE\toni2app\.sencha\app\build-impl.xml:92: Th
    e following error occurred while executing this line:
    [ERR]           jar:file:/C:/Users/AntonioMarcosP/bin/Sencha/Cmd/3.0.0.250/sench
    a.jar!/com/sencha/ant/antlib.xml:347: shellscript returned: 1
    [ERR]                   at org.apache.tools.ant.ProjectHelper.addLocationToBuild
    Exception(ProjectHelper.java:551)
    [ERR]                   at org.apache.tools.ant.taskdefs.Ant.execute(Ant.java:44
    4)
    [ERR]                   at org.apache.tools.ant.taskdefs.CallTarget.execute(Call
    Target.java:105)
    [ERR]                   at org.apache.tools.ant.UnknownElement.execute(UnknownEl
    ement.java:291)
    [ERR]                   at sun.reflect.GeneratedMethodAccessor8.invoke(Unknown S
    ource)
    [ERR]                   at sun.reflect.DelegatingMethodAccessorImpl.invoke(Unkno
    wn Source)
    [ERR]                   at java.lang.reflect.Method.invoke(Unknown Source)
    [ERR]                   at org.apache.tools.ant.dispatch.DispatchUtils.execute(D
    ispatchUtils.java:106)
    [ERR]                   at org.apache.tools.ant.Task.perform(Task.java:348)
    [ERR]                   at org.apache.tools.ant.Target.execute(Target.java:392)
    [ERR]                   at org.apache.tools.ant.Target.performTasks(Target.java:
    413)
    [ERR]                   at org.apache.tools.ant.Project.executeSortedTargets(Pro
    ject.java:1399)
    [ERR]                   at org.apache.tools.ant.Project.executeTarget(Project.ja
    va:1368)
    [ERR]                   at org.apache.tools.ant.helper.DefaultExecutor.executeTa
    rgets(DefaultExecutor.java:41)
    [ERR]                   at org.apache.tools.ant.Project.executeTargets(Project.j
    ava:1251)
    [ERR]                   at com.sencha.ant.AntRunner.run(AntRunner.java:156)
    [ERR]                   at com.sencha.ant.AntRunner.run(AntRunner.java:80)
    [ERR]                   at com.sencha.command.ant.AntCommand.execute(AntCommand.
    java:75)
    [ERR]                   at sun.reflect.NativeMethodAccessorImpl.invoke0(Native M
    ethod)
    [ERR]                   at sun.reflect.NativeMethodAccessorImpl.invoke(Unknown S
    ource)
    [ERR]                   at sun.reflect.DelegatingMethodAccessorImpl.invoke(Unkno
    wn Source)
    [ERR]                   at java.lang.reflect.Method.invoke(Unknown Source)
    [ERR]                   at com.sencha.cli.Command.dispatch(Command.java:78)
    [ERR]                   ... 31 more
    [ERR]           Caused by: F:\Dropbox\www\MOBILE\toni2app\.sencha\app\build-impl
    .xml:92: The following error occurred while executing this line:
    [ERR]           jar:file:/C:/Users/AntonioMarcosP/bin/Sencha/Cmd/3.0.0.250/sench
    a.jar!/com/sencha/ant/antlib.xml:347: shellscript returned: 1
    [ERR]                   at org.apache.tools.ant.ProjectHelper.addLocationToBuild
    Exception(ProjectHelper.java:551)
    [ERR]                   at org.apache.tools.ant.taskdefs.MacroInstance.execute(M
    acroInstance.java:401)
    [ERR]                   at org.apache.tools.ant.UnknownElement.execute(UnknownEl
    ement.java:291)
    [ERR]                   at sun.reflect.GeneratedMethodAccessor8.invoke(Unknown S
    ource)
    [ERR]                   at sun.reflect.DelegatingMethodAccessorImpl.invoke(Unkno
    wn Source)
    [ERR]                   at java.lang.reflect.Method.invoke(Unknown Source)
    [ERR]                   at org.apache.tools.ant.dispatch.DispatchUtils.execute(D
    ispatchUtils.java:106)
    [ERR]                   at org.apache.tools.ant.Task.perform(Task.java:348)
    [ERR]                   at org.apache.tools.ant.Target.execute(Target.java:392)
    [ERR]                   at org.apache.tools.ant.Target.performTasks(Target.java:
    413)
    [ERR]                   at org.apache.tools.ant.Project.executeSortedTargets(Pro
    ject.java:1399)
    [ERR]                   at org.apache.tools.ant.helper.SingleCheckExecutor.execu
    teTargets(SingleCheckExecutor.java:38)
    [ERR]                   at org.apache.tools.ant.Project.executeTargets(Project.j
    ava:1251)
    [ERR]                   at org.apache.tools.ant.taskdefs.Ant.execute(Ant.java:44
    2)
    [ERR]                   ... 52 more
    [ERR]           Caused by: jar:file:/C:/Users/AntonioMarcosP/bin/Sencha/Cmd/3.0.
    0.250/sencha.jar!/com/sencha/ant/antlib.xml:347: shellscript returned: 1
    [ERR]                   at org.apache.tools.ant.taskdefs.ExecTask.runExecute(Exe
    cTask.java:646)
    [ERR]                   at org.apache.tools.ant.taskdefs.ExecTask.runExec(ExecTa
    sk.java:672)
    [ERR]                   at org.apache.tools.ant.taskdefs.ExecTask.execute(ExecTa
    sk.java:498)
    [ERR]                   at net.sf.antcontrib.platform.ShellScriptTask.execute(Sh
    ellScriptTask.java:132)
    [ERR]                   at org.apache.tools.ant.UnknownElement.execute(UnknownEl
    ement.java:291)
    [ERR]                   at sun.reflect.GeneratedMethodAccessor8.invoke(Unknown S
    ource)
    [ERR]                   at sun.reflect.DelegatingMethodAccessorImpl.invoke(Unkno
    wn Source)
    [ERR]                   at java.lang.reflect.Method.invoke(Unknown Source)
    [ERR]                   at org.apache.tools.ant.dispatch.DispatchUtils.execute(D
    ispatchUtils.java:106)
    [ERR]                   at org.apache.tools.ant.Task.perform(Task.java:348)
    [ERR]                   at org.apache.tools.ant.taskdefs.Sequential.execute(Sequ
    ential.java:68)
    [ERR]                   at net.sf.antcontrib.logic.IfTask.execute(IfTask.java:19
    7)
    [ERR]                   at sun.reflect.NativeMethodAccessorImpl.invoke0(Native M
    ethod)
    [ERR]                   at sun.reflect.NativeMethodAccessorImpl.invoke(Unknown S
    ource)
    [ERR]                   at sun.reflect.DelegatingMethodAccessorImpl.invoke(Unkno
    wn Source)
    [ERR]                   at java.lang.reflect.Method.invoke(Unknown Source)
    [ERR]                   at org.apache.tools.ant.dispatch.DispatchUtils.execute(D
    ispatchUtils.java:106)
    [ERR]                   at org.apache.tools.ant.TaskAdapter.execute(TaskAdapter.
    java:154)
    [ERR]                   at org.apache.tools.ant.UnknownElement.execute(UnknownEl
    ement.java:291)
    [ERR]                   at sun.reflect.GeneratedMethodAccessor8.invoke(Unknown S
    ource)
    [ERR]                   at sun.reflect.DelegatingMethodAccessorImpl.invoke(Unkno
    wn Source)
    [ERR]                   at java.lang.reflect.Method.invoke(Unknown Source)
    [ERR]                   at org.apache.tools.ant.dispatch.DispatchUtils.execute(D
    ispatchUtils.java:106)
    [ERR]                   at org.apache.tools.ant.Task.perform(Task.java:348)
    [ERR]                   at org.apache.tools.ant.taskdefs.Sequential.execute(Sequ
    ential.java:68)
    [ERR]                   at net.sf.antcontrib.logic.IfTask.execute(IfTask.java:19
    7)
    [ERR]                   at sun.reflect.NativeMethodAccessorImpl.invoke0(Native M
    ethod)
    [ERR]                   at sun.reflect.NativeMethodAccessorImpl.invoke(Unknown S
    ource)
    [ERR]                   at sun.reflect.DelegatingMethodAccessorImpl.invoke(Unkno
    wn Source)
    [ERR]                   at java.lang.reflect.Method.invoke(Unknown Source)
    [ERR]                   at org.apache.tools.ant.dispatch.DispatchUtils.execute(D
    ispatchUtils.java:106)
    [ERR]                   at org.apache.tools.ant.TaskAdapter.execute(TaskAdapter.
    java:154)
    [ERR]                   at org.apache.tools.ant.UnknownElement.execute(UnknownEl
    ement.java:291)
    [ERR]                   at sun.reflect.GeneratedMethodAccessor8.invoke(Unknown S
    ource)
    [ERR]                   at sun.re
    [ERR]           flect.DelegatingMethodAccessorImpl.invoke(Unknown Source)
    [ERR]                   at java.lang.reflect.Method.invoke(Unknown Source)
    [ERR]                   at org.apache.tools.ant.dispatch.DispatchUtils.execute(D
    ispatchUtils.java:106)
    [ERR]                   at org.apache.tools.ant.Task.perform(Task.java:348)
    [ERR]                   at org.apache.tools.ant.taskdefs.Sequential.execute(Sequ
    ential.java:68)
    [ERR]                   at org.apache.tools.ant.UnknownElement.execute(UnknownEl
    ement.java:291)
    [ERR]                   at sun.reflect.GeneratedMethodAccessor8.invoke(Unknown S
    ource)
    [ERR]                   at sun.reflect.DelegatingMethodAccessorImpl.invoke(Unkno
    wn Source)
    [ERR]                   at java.lang.reflect.Method.invoke(Unknown Source)
    [ERR]                   at org.apache.tools.ant.dispatch.DispatchUtils.execute(D
    ispatchUtils.java:106)
    [ERR]                   at org.apache.tools.ant.Task.perform(Task.java:348)
    [ERR]                   at org.apache.tools.ant.taskdefs.MacroInstance.execute(M
    acroInstance.java:398)
    [ERR]                   ... 64 more
    [ERR]           Total time: 3 seconds
    [ERR]           com.sencha.exceptions.BasicException: The following error occurr
    ed while executing this line:
    F:\Dropbox\www\MOBILE\toni2app\.sencha\app\build-impl.xml:92: The following erro
    r occurred while executing this line:
    jar:file:/C:/Users/AntonioMarcosP/bin/Sencha/Cmd/3.0.0.250/sencha.jar!/com/sench
    a/ant/antlib.xml:347: shellscript returned: 1

  2. #2
    Sencha - Senior Forum Manager mitchellsimoens's Avatar
    Join Date
    Mar 2007
    Location
    Gainesville, FL
    Posts
    36,522
    Answers
    3447
    Vote Rating
    814
    mitchellsimoens has a reputation beyond repute mitchellsimoens has a reputation beyond repute mitchellsimoens has a reputation beyond repute mitchellsimoens has a reputation beyond repute mitchellsimoens has a reputation beyond repute mitchellsimoens has a reputation beyond repute mitchellsimoens has a reputation beyond repute mitchellsimoens has a reputation beyond repute mitchellsimoens has a reputation beyond repute mitchellsimoens has a reputation beyond repute mitchellsimoens has a reputation beyond repute

      -1  

    Default


    Look at the first error, there is a SASS error
    Mitchell Simoens @SenchaMitch
    Sencha Inc, Senior Forum Manager
    ________________
    Check out my GitHub, lots of nice things for Ext JS 4 and Sencha Touch 2
    https://github.com/mitchellsimoens

    Think my support is good? Get more personalized support via a support subscription. https://www.sencha.com/store/

    Need more help with your app? Hire Sencha Services services@sencha.com

    Want to learn Sencha Touch 2? Check out Sencha Touch in Action that is in print!

    When posting code, please use BBCode's CODE tags.

  3. #3
    Sencha User
    Join Date
    Jan 2013
    Posts
    18
    Vote Rating
    1
    new2st is on a distinguished road

      0  

    Default


    I've got the same error, however I just generate a get started project with sencha command. I did't modify anything in the app.scss file so it's should be an error generated by sencha command...
    Please tell us how to fix this error, I've no idea in which config file I should define this base-gradient variable

  4. #4
    Sencha User amarcos3032's Avatar
    Join Date
    Jan 2013
    Location
    Brasil
    Posts
    7
    Vote Rating
    0
    amarcos3032 is on a distinguished road

      0  

    Default Problems with Build Failed - resolved

    Problems with Build Failed - resolved


    Thank you friends


    Upgraded to version 3.0.2.288 the senchaCMD, the problem solved.

    thank you