1. #1
    Sencha User
    Join Date
    Oct 2012
    Posts
    4
    Vote Rating
    0
    arshabh.clarice is on a distinguished road

      0  

    Default Unanswered: my sencha build fails without clear erroe

    Unanswered: my sencha build fails without clear erroe


    when i run my sencha app build my build fails and i am unable to make a build. i am pasting the code returned by cmd line and i would appreciate a help in this regard, the main problem is i dont understand that why did the build fail.

    Code:
    Microsoft Windows [Version 6.1.7601]
    Copyright (c) 2009 Microsoft Corporation.  All rights reserved.
    The system cannot find the path specified.
    
    
    C:\Users\User>cd c:/wamp/www
    
    
    c:\wamp\www>cd touch-practice
    
    
    c:\wamp\www\touch-practice>cd gs
    
    
    c:\wamp\www\touch-practice\GS>sencha app build
    Sencha Cmd v3.0.0.250
    [INF]           init-properties:
    [INF]           init-sencha-command:
    [INF]           init:
    [INF]           -before-app-build:
    [INF]           app-build-impl:
    [INF]           production:
    [INF]           -before-init-local:
    [INF]           -init-local:
    [INF]           -after-init-local:
    [INF]           init-local:
    [INF]           find-cmd:
    [INF]           -before-init:
    [INF]           -init:
    [INF]           -after-init:
    [INF]           init:
    [INF]           -before-build:
    [INF]           sass:
    [INF]           -before-sass:
    [INF]           -sass:
    [INF]           [shellscript] The system cannot find the path specified.
    [INF]           [shellscript]
    [INF]           [shellscript] C:\wamp\www\touch-practice\GS\resources\sass>compa
    ss compile --boring --force
    [INF]           [shellscript] identical ../css/app.css
    [ERR]           BUILD FAILED
    [ERR]           com.sencha.exceptions.BasicException: The following error occurr
    ed while executing this line:
    [ERR]           C:\wamp\www\touch-practice\GS\.sencha\app\build-impl.xml:92: The
     following error occurred while executing this line:
    [ERR]           jar:file:/C:/Program%20Files/SenchaSDKTools-2.0.0-beta3/bin/Senc
    ha/Cmd/3.0.0.250/sencha.jar!/com/sencha/ant/antlib.xml:347: shellscript returned
    : 1
    [ERR]                   at com.sencha.exceptions.BasicException.wrap(BasicExcept
    ion.java:43)
    [ERR]                   at com.sencha.cli.Command.dispatch(Command.java:104)
    [ERR]                   at com.sencha.cli.Commands.dispatch(Commands.java:49)
    [ERR]                   at com.sencha.cli.AbstractCommand.dispatch(AbstractComma
    nd.java:182)
    [ERR]                   at com.sencha.ant.SenchaCommandTask.doExecute(SenchaComm
    andTask.java:58)
    [ERR]                   at com.sencha.ant.BaseAntTask.execute(BaseAntTask.java:2
    2)
    [ERR]                   at org.apache.tools.ant.UnknownElement.execute(UnknownEl
    ement.java:291)
    [ERR]                   at sun.reflect.NativeMethodAccessorImpl.invoke0(Native M
    ethod)
    [ERR]                   at sun.reflect.NativeMethodAccessorImpl.invoke(NativeMet
    hodAccessorImpl.java:39)
    [ERR]                   at sun.reflect.DelegatingMethodAccessorImpl.invoke(Deleg
    atingMethodAccessorImpl.java:25)
    [ERR]                   at java.lang.reflect.Method.invoke(Method.java:597)
    [ERR]                   at org.apache.tools.ant.dispatch.DispatchUtils.execute(D
    ispatchUtils.java:106)
    [ERR]                   at org.apache.tools.ant.Task.perform(Task.java:348)
    [ERR]                   at org.apache.tools.ant.Target.execute(Target.java:392)
    [ERR]                   at org.apache.tools.ant.Target.performTasks(Target.java:
    413)
    [ERR]                   at org.apache.tools.ant.Project.executeSortedTargets(Pro
    ject.java:1399)
    [ERR]                   at org.apache.tools.ant.Project.executeTarget(Project.ja
    va:1368)
    [ERR]                   at org.apache.tools.ant.helper.DefaultExecutor.executeTa
    rgets(DefaultExecutor.java:41)
    [ERR]                   at org.apache.tools.ant.Project.executeTargets(Project.j
    ava:1251)
    [ERR]                   at com.sencha.ant.AntRunner.run(AntRunner.java:156)
    [ERR]                   at com.sencha.ant.AntRunner.run(AntRunner.java:72)
    [ERR]                   at com.sencha.command.BasePluginCommands$BasePluginComma
    nd.run(BasePluginCommands.java:87)
    [ERR]                   at com.sencha.command.BasePluginCommands$BasePluginComma
    nd.run(BasePluginCommands.java:91)
    [ERR]                   at com.sencha.command.BasePluginCommands$BaseNamePathCom
    mand.run(BasePluginCommands.java:135)
    [ERR]                   at com.sencha.command.app.AppCommands$BuildCommand.execu
    te(AppCommands.java:106)
    [ERR]                   at sun.reflect.NativeMethodAccessorImpl.invoke0(Native M
    ethod)
    [ERR]                   at sun.reflect.NativeMethodAccessorImpl.invoke(NativeMet
    hodAccessorImpl.java:39)
    [ERR]                   at sun.reflect.DelegatingMethodAccessorImpl.invoke(Deleg
    atingMethodAccessorImpl.java:25)
    [ERR]                   at java.lang.reflect.Method.invoke(Method.java:597)
    [ERR]                   at com.sencha.cli.Command.dispatch(Command.java:78)
    [ERR]                   at com.sencha.cli.Commands.dispatch(Commands.java:49)
    [ERR]                   at com.sencha.cli.Commands.dispatch(Commands.java:49)
    [ERR]                   at com.sencha.command.Sencha.main(Sencha.java:71)
    [ERR]           Caused by: C:\wamp\www\touch-practice\GS\.sencha\app\build-impl.
    xml:100: The following error occurred while executing this line:
    [ERR]           C:\wamp\www\touch-practice\GS\.sencha\app\build-impl.xml:92: The
     following error occurred while executing this line:
    [ERR]           jar:file:/C:/Program%20Files/SenchaSDKTools-2.0.0-beta3/bin/Senc
    ha/Cmd/3.0.0.250/sencha.jar!/com/sencha/ant/antlib.xml:347: shellscript returned
    : 1
    [ERR]                   at org.apache.tools.ant.ProjectHelper.addLocationToBuild
    Exception(ProjectHelper.java:551)
    [ERR]                   at org.apache.tools.ant.taskdefs.Ant.execute(Ant.java:44
    4)
    [ERR]                   at org.apache.tools.ant.taskdefs.CallTarget.execute(Call
    Target.java:105)
    [ERR]                   at org.apache.tools.ant.UnknownElement.execute(UnknownEl
    ement.java:291)
    [ERR]                   at sun.reflect.GeneratedMethodAccessor8.invoke(Unknown S
    ource)
    [ERR]                   at sun.reflect.DelegatingMethodAccessorImpl.invoke(Deleg
    atingMethodAccessorImpl.java:25)
    [ERR]                   at java.lang.reflect.Method.invoke(Method.java:597)
    [ERR]                   at org.apache.tools.ant.dispatch.DispatchUtils.execute(D
    ispatchUtils.java:106)
    [ERR]                   at org.apache.tools.ant.Task.perform(Task.java:348)
    [ERR]                   at org.apache.tools.ant.Target.execute(Target.java:392)
    [ERR]                   at org.apache.tools.ant.Target.performTasks(Target.java:
    413)
    [ERR]                   at org.apache.tools.ant.Project.executeSortedTargets(Pro
    ject.java:1399)
    [ERR]                   at org.apache.tools.ant.Project.executeTarget(Project.ja
    va:1368)
    [ERR]                   at org.apache.tools.ant.helper.DefaultExecutor.executeTa
    rgets(DefaultExecutor.java:41)
    [ERR]                   at org.apache.tools.ant.Project.executeTargets(Project.j
    ava:1251)
    [ERR]                   at com.sencha.ant.AntRunner.run(AntRunner.java:156)
    [ERR]                   at com.sencha.ant.AntRunner.run(AntRunner.java:80)
    [ERR]                   at com.sencha.command.ant.AntCommand.execute(AntCommand.
    java:75)
    [ERR]                   at sun.reflect.NativeMethodAccessorImpl.invoke0(Native M
    ethod)
    [ERR]                   at sun.reflect.NativeMethodAccessorImpl.invoke(NativeMet
    hodAccessorImpl.java:39)
    [ERR]                   at sun.reflect.DelegatingMethodAccessorImpl.invoke(Deleg
    atingMethodAccessorImpl.java:25)
    [ERR]                   at java.lang.reflect.Method.invoke(Method.java:597)
    [ERR]                   at com.sencha.cli.Command.dispatch(Command.java:78)
    [ERR]                   ... 31 more
    [ERR]           Caused by: C:\wamp\www\touch-practice\GS\.sencha\app\build-impl.
    xml:92: The following error occurred while executing this line:
    [ERR]           jar:file:/C:/Program%20Files/SenchaSDKTools-2.0.0-beta3/bin/Senc
    ha/Cmd/3.0.0.250/sencha.jar!/com/sencha/ant/antlib.xml:347: shellscript returned
    : 1
    [ERR]                   at org.apache.tools.ant.ProjectHelper.addLocationToBuild
    Exception(ProjectHelper.java:551)
    [ERR]                   at org.apache.tools.ant.taskdefs.MacroInstance.execute(M
    acroInstance.java:401)
    [ERR]                   at org.apache.tools.ant.UnknownElement.execute(UnknownEl
    ement.java:291)
    [ERR]                   at sun.reflect.GeneratedMethodAccessor8.invoke(Unknown S
    ource)
    [ERR]                   at sun.reflect.DelegatingMethodAccessorImpl.invoke(Deleg
    atingMethodAccessorImpl.java:25)
    [ERR]                   at java.lang.reflect.Method.invoke(Method.java:597)
    [ERR]                   at org.apache.tools.ant.dispatch.DispatchUtils.execute(D
    ispatchUtils.java:106)
    [ERR]                   at org.apache.tools.ant.Task.perform(Task.java:348)
    [ERR]                   at org.apache.tools.ant.Target.execute(Target.java:392)
    [ERR]                   at org.apache.tools.ant.Target.performTasks(Target.java:
    413)
    [ERR]                   at org.apache.tools.ant.Project.executeSortedTargets(Pro
    ject.java:1399)
    [ERR]                   at org.apache.tools.ant.helper.SingleCheckExecutor.execu
    teTargets(SingleCheckExecutor.java:38)
    [ERR]                   at org.apache.tools.ant.Project.executeTargets(Project.j
    ava:1251)
    [ERR]                   at org.apache.tools.ant.taskdefs.Ant.execute(Ant.java:44
    2)
    [ERR]                   ... 52 more
    [ERR]           Caused by: jar:file:/C:/Program%20Files/SenchaSDKTools-2.0.0-bet
    a3/bin/Sencha/Cmd/3.0.0.250/sencha.jar!/com/sencha/ant/antlib.xml:347: shellscri
    pt returned: 1
    [ERR]                   at org.apache.tools.ant.taskdefs.ExecTask.runExecute(Exe
    cTask.java:646)
    [ERR]                   at org.apache.tools.ant.taskdefs.ExecTask.runExec(ExecTa
    sk.java:672)
    [ERR]                   at org.apache.tools.ant.taskdefs.ExecTask.execute(ExecTa
    sk.java:498)
    [ERR]                   at net.sf.antcontrib.platform.ShellScriptTask.execute(Sh
    ellScriptTask.java:132)
    [ERR]                   at org.apache.tools.ant.UnknownElement.execute(UnknownEl
    ement.java:291)
    [ERR]                   at sun.reflect.GeneratedMethodAccessor8.invoke(Unknown S
    ource)
    [ERR]                   at sun.reflect.DelegatingMethodAccessorImpl.invoke(Deleg
    atingMethodAccessorImpl.java:25)
    [ERR]                   at java.lang.reflect.Method.invoke(Method.java:597)
    [ERR]                   at org.apache.tools.ant.dispatch.DispatchUtils.execute(D
    ispatchUtils.java:106)
    [ERR]                   at org.apache.tools.ant.Task.perform(Task.java:348)
    [ERR]                   at org.apache.tools.ant.taskdefs.Sequential.execute(Sequ
    ential.java:68)
    [ERR]                   at net.sf.antcontrib.logic.IfTask.execute(IfTask.java:19
    7)
    [ERR]                   at sun.reflect.NativeMethodAccessorImpl.invoke0(Native M
    ethod)
    [ERR]                   at sun.reflect.NativeMethodAccessorImpl.invoke(NativeMet
    hodAccessorImpl.java:39)
    [ERR]                   at sun.reflect.DelegatingMethodAccessorImpl.invoke(Deleg
    atingMethodAccessorImpl.java:25)
    [ERR]                   at java.lang.reflect.Method.invoke(Method.java:597)
    [ERR]                   at org.apache.tools.ant.dispatch.DispatchUtils.execute(D
    ispatchUtils.java:106)
    [ERR]                   at org.apache.tools.ant.TaskAdapter.execute(TaskAdapter.
    java:154)
    [ERR]                   at org.apache.tools.ant.UnknownElement.execute(UnknownEl
    ement.java:291)
    [ERR]                   at sun.reflect.GeneratedMethodAccessor8.invoke(Unknown S
    ource)
    [ERR]                   at sun.reflect.DelegatingMethodAccessorImpl.invoke(Deleg
    atingMethodAccessorImpl.java:25)
    [ERR]                   at java.lang.reflect.Method.invoke(Method.java:597)
    [ERR]                   at org.apache.tools.ant.dispatch.DispatchUtils.execute(D
    ispatchUtils.java:106)
    [ERR]                   at org.apache.tools.ant.Task.perform(Task.java:348)
    [ERR]                   at org.apache.tools.ant.taskdefs.Sequential.execute(Sequ
    ential.java:68)
    [ERR]                   at net.sf.antcontrib.logic.IfTask.execute(IfTask.java:19
    7)
    [ERR]                   at sun.reflect.NativeMethodAccessorImpl.invoke0(Native M
    ethod)
    [ERR]                   at sun.reflect.NativeMethodAccessorImpl.invoke(NativeMet
    hodAccessorImpl.java:39)
    [ERR]                   at sun.reflect.DelegatingMethodAccessorImpl.invoke(Deleg
    ating
    [ERR]           MethodAccessorImpl.java:25)
    [ERR]                   at java.lang.reflect.Method.invoke(Method.java:597)
    [ERR]                   at org.apache.tools.ant.dispatch.DispatchUtils.execute(D
    ispatchUtils.java:106)
    [ERR]                   at org.apache.tools.ant.TaskAdapter.execute(TaskAdapter.
    java:154)
    [ERR]                   at org.apache.tools.ant.UnknownElement.execute(UnknownEl
    ement.java:291)
    [ERR]                   at sun.reflect.GeneratedMethodAccessor8.invoke(Unknown S
    ource)
    [ERR]                   at sun.reflect.DelegatingMethodAccessorImpl.invoke(Deleg
    atingMethodAccessorImpl.java:25)
    [ERR]                   at java.lang.reflect.Method.invoke(Method.java:597)
    [ERR]                   at org.apache.tools.ant.dispatch.DispatchUtils.execute(D
    ispatchUtils.java:106)
    [ERR]                   at org.apache.tools.ant.Task.perform(Task.java:348)
    [ERR]                   at org.apache.tools.ant.taskdefs.Sequential.execute(Sequ
    ential.java:68)
    [ERR]                   at org.apache.tools.ant.UnknownElement.execute(UnknownEl
    ement.java:291)
    [ERR]                   at sun.reflect.GeneratedMethodAccessor8.invoke(Unknown S
    ource)
    [ERR]                   at sun.reflect.DelegatingMethodAccessorImpl.invoke(Deleg
    atingMethodAccessorImpl.java:25)
    [ERR]                   at java.lang.reflect.Method.invoke(Method.java:597)
    [ERR]                   at org.apache.tools.ant.dispatch.DispatchUtils.execute(D
    ispatchUtils.java:106)
    [ERR]                   at org.apache.tools.ant.Task.perform(Task.java:348)
    [ERR]                   at org.apache.tools.ant.taskdefs.MacroInstance.execute(M
    acroInstance.java:398)
    [ERR]                   ... 64 more
    [ERR]           Total time: 12 seconds
    [ERR]           com.sencha.exceptions.BasicException: The following error occurr
    ed while executing this line:
    C:\wamp\www\touch-practice\GS\.sencha\app\build-impl.xml:92: The following error
     occurred while executing this line:
    jar:file:/C:/Program%20Files/SenchaSDKTools-2.0.0-beta3/bin/Sencha/Cmd/3.0.0.250
    /sencha.jar!/com/sencha/ant/antlib.xml:347: shellscript returned: 1

  2. #2
    Sencha - Support Team
    Join Date
    Mar 2012
    Location
    Lawrence, KS
    Posts
    285
    Vote Rating
    35
    Answers
    42
    greg.barry has a spectacular aura about greg.barry has a spectacular aura about

      0  

    Default Compass and SASS

    Compass and SASS


    It would appear that you do not have Compass/SASS installed on your machine. Or rather, Cmd cannot find your path to your Compass and SASS installations.

    If you have not installed them, this is a helpful guide:
    http://css-tricks.com/forums/discuss...-on-windows/p1

    If you do have them installed, the above link also makes references to setting your paths.

    Please keep in mind that earlier versions of the SDK tools did not require Compass and SASS.

    Thanks!
    Greg

Thread Participants: 1