You found a bug! We've classified it as SDKTOOLS-438 . We encourage you to continue the discussion and to find an acceptable workaround while we work on a permanent fix.
  1. #1
    Sencha User
    Join Date
    Apr 2013
    Posts
    13
    Vote Rating
    1
    mmls is on a distinguished road

      0  

    Default sencha app build failed when path contained an apostrophe

    sencha app build failed when path contained an apostrophe


    Windows 7 Enterprise sp1
    SDK ExtJS 4.2.0.663
    Sencha Command 3.1.1.274
    Ruby 1.93

    Just tried a first install of Sencha command. Running "sencha app build" failed.
    This looks like it may be because the path had an apostrophe in it. In this case it is the actual user name.

    In the below error UserName should be U'serName. (I've removed the real user name and part of the path.) Note that the apostrophe is missing from the first error, and occurs 3 times in the next error message.

    [INF] -sass:
    [INF] executing compass using system installed ruby runtime
    Configuration file, C:\Users\UserName\[removed]\Spt1\buildSpt\production\
    config.rb --css-dir C:\Users\UserName\[removed]\Spt1\build\Spt\production\
    resources, not found or not readable.
    [ERR]
    [ERR] BUILD FAILED
    [ERR] com.sencha.exceptions.ExProcess: compass process exited with non-zero code
    : 1
    [ERR]
    [ERR] Total time: 26 seconds
    [ERR]
    [ERR] BUILD FAILED
    [ERR] com.sencha.exceptions.BasicException: The following error occurred while e
    xecuting this line:
    [ERR] C:\Users\U'''serName\[removed]\Spt1\.sencha\app\build-impl.xml:248:
    com.sencha.exceptions.ExProcess: compass process exited with non-zero code : 1
    [ERR]
    [ERR] Total time: 27 seconds

  2. #2
    Sencha - Senior Forum Manager mitchellsimoens's Avatar
    Join Date
    Mar 2007
    Location
    Gainesville, FL
    Posts
    37,220
    Vote Rating
    859
    mitchellsimoens has a reputation beyond repute mitchellsimoens has a reputation beyond repute mitchellsimoens has a reputation beyond repute mitchellsimoens has a reputation beyond repute mitchellsimoens has a reputation beyond repute mitchellsimoens has a reputation beyond repute mitchellsimoens has a reputation beyond repute mitchellsimoens has a reputation beyond repute mitchellsimoens has a reputation beyond repute mitchellsimoens has a reputation beyond repute mitchellsimoens has a reputation beyond repute

      0  

    Default


    Thanks for the report! I have opened a bug in our bug tracker.

Thread Participants: 1