PDA

View Full Version : Sencha Cmd



Pages : 1 2 3 4 5 [6] 7 8 9 10 11 12 13 14

  1. Sencha Cmd 4.0 Beta and Sencha Touch 2.3.0 Beta throws error. Solution inside
  2. Using Sencha Cmd to compress JS
  3. Moving from JSB Files
  4. Cmd crashes on app upgrade when sdk directory vanishes
  5. Preparing ExtJS all-classes.js via Sencha Cmd
  6. Sencha Cmd 3.1.2 ignoring "isIconPrecomposed" property?
  7. Solved Sencha Cmd failing with "[ERR] null" related to Subversion 1.6
  8. Sencha CMD commons on workspaces
  9. custom.js/manifest.js – Generating sliced images for custom UI components
  10. Using custom compass compiler
  11. Change the temp dir?
  12. Minified file size is 1+ mb.
  13. SenchaCMD SASS Compass Error
  14. Sencha command packing .hg folder into apk
  15. testing generated app calls unnecessary js files
  16. [solved] How to fix warning in build about older version (0.0.0.0) of Sencha Cmd?
  17. difficulty with "sencha package upgrade" and "sencha app refresh --packages"
  18. Skipping Sass/ CSS
  19. Sencha/3.1.2.342/phantomjs/phantom/bin/phantomjs: error while loading shared librarie
  20. Sencha Cmd 3.1.2.342 generate app uses 2 app.js files and defines app twice
  21. Sencha Touch 2.2.1 app installtaion failure on IOS 6.0 with Sencha Cmd 3.1.2
  22. Cannot set the Compass environment variable
  23. CMD runs successfully, but EXTJS4 app crashes on run at line 22374
  24. What is Ext.cmd.derive?
  25. sencha android live app error
  26. Documentation Bugs
  27. How to add -before-build task to plugin.xml
  28. Sencha CMD + association
  29. The right way to add classes and external images
  30. Compile File Size
  31. sencha app build testing has trouble finding JS files outside app-directory
  32. Order in all-classes.js on app build is wrong
  33. generate app - set default starter application
  34. How to specify the loader path
  35. Errors at runtime with generated sencha touch app
  36. Sencha Architect failed to setup with Sencha Cmd (all are latest versions)
  37. Error building Extjs 4.2 app using Sencha CMD
  38. Use Sencha command to give two output files
  39. [FIXED] [Sencha Cmd v3.1.2.342] Dynamic "requires" option analyze failure
  40. Sencha Cmd + JRuby
  41. Sencha Cmd v4.0.0 Beta 1 is Now Available
  42. Android App is empty
  43. Sencha Cmd build, all-classes.js not loading few models
  44. OSX IDEs + Cmd 4beta + Cordova
  45. App build failed => Java Heap Space problem
  46. 3.1.2 "sencha app build" and long folder structure
  47. Get Old versions of Sencha Command
  48. when "sencha app build production" where does index.html get lines from?
  49. sencha app watch endless loop
  50. Sencha touch upgrade error invalid property id
  51. [FIXED] How to generate JS source map?
  52. Best practice for sharing a common ux library?
  53. HelpingHand - Rhino Parse Error
  54. [Cmd 3.1.2.342, Ext 4.2.1] Building a code package that extends Ext components
  55. Loading a few classes already all-classes.js
  56. "Unknown definition for dependency" compile error
  57. 2 issues log4j:WARN & no index.html or app.json file in Build folder
  58. how to increase speed of accessing sencha touch 2 app
  59. Creating Workspace, Applications and Themes with Sencha Cmd Video
  60. Sencha cmd build is failing continuously
  61. Generate and build sample app
  62. [Cmd 3.1.2] Ext.Loader path prefix?
  63. Sencha Cmd and JsDuck
  64. sencha cmd proxy problem
  65. [CMD 4.0.0 beta 1] "sencha upgrade --beta" doesn't work
  66. Changing the build folder [Sencha Cmd v4.0.0.125]
  67. PhantomJS crashes but still builds
  68. Test environment runs, production not
  69. Slicing complete - generated 0 images
  70. com.sencha.exceptions.BasicException
  71. Uncaught Error: [Ext.Loader] Failed loading synchronously via XHR: 'idgen/sequential.
  72. "sencha app build" adds link to built css from bootstrap.css
  73. Distributing app outside app store for ios
  74. sencha app build = PARRENTCLASS error (ExtJS 4.1)
  75. Absolute base path in bootstrap.js
  76. classes-all.js seen as binary file by diff tool
  77. Sencha app build / slicing image for IE
  78. Sencha cmd logger issue
  79. Sencha cmd still has bug with hasMany/belogsTo (need workaround)
  80. How can I compile only the SASS files in SC4.0.0
  81. Strip whitespace with sencha cmd without using compression
  82. Problem with SenchaCmd 4.0
  83. app builds but multiple failed to load resource errors
  84. Uncaught TypeError: object is not a function
  85. treepanel not working when producing theme using sencha cmd 3.1.2 for extjs.4.2.1
  86. sencha cmd build fails at deployment
  87. Exclude files from build
  88. Ext.Msg doesnt appear to be part of my app.js after Cmd
  89. Maven build almost working
  90. [OPEN] Specifying ext.dir property at command line causes java exception
  91. about applicationName how to use chinese character
  92. using multiple versions of CMD on one computer
  93. Can't start webserver: [ERR] Cannot create server socket
  94. Debug js file generated with sencha cmd
  95. stbuild.exe has stopped working (iOS Packaging)
  96. How to include custom components CSS in build CSS
  97. [OPEN] Add a property to specify the example.css location
  98. Cannot generate testing/production builds with sencha cmd
  99. Sencha CMD 4 Time-out issues:
  100. Sencha with Gradle
  101. Wrong compress with Sencha CMD 2.0
  102. can't switch app to use Sencha Touch 2.2.1
  103. [FIXED] [4.0.0 beta] mixins as json making production build fail
  104. upggrading to 4.0.0 beta: build with only required classes
  105. Framework-Directive
  106. How to install SenchaCmd Framework using Command Line on Mac
  107. Documentation error: "Guide command_reference was not found."
  108. Image slicing only generating one image per component?
  109. [FIXED] Sencha Cmd and Ruby 2.0
  110. CMD 4 Store loading issue
  111. Cannot get Ext requirements file only
  112. Ext.Viewport.getOrientation() undefined
  113. Common folder on my workspace
  114. sencha app build depends on refresh rule now
  115. Having sencha in my project
  116. Custom replacement of text in index.html during build
  117. Custom JS files are not getting bundled when packaging Touch app
  118. phantomjs crashes during the build using Sencha Cmd 4.0.0.126
  119. keep debug listings when using "sencha app build testing"
  120. [4.0.0.126] x-split-css generating files, but not being used
  121. Sencha Cmd upgrade issues
  122. Bug: app.ignores and compile#ignore does not work
  123. [FIXED] sencha compile cannot parse ext-dev.js
  124. [NOREPRO] Cannot download Sencha Cmd
  125. ExtJs version dependency in package.json?
  126. Cannot produce a working app through compile command
  127. Building app that use package•••••••••••••
  128. Sencha Cmd for NetBeans IDE
  129. SenchCmd 3.1.2.342 "whitespace spaces" patch proposal
  130. Signing Sencha Cmd Packages
  131. java.lang.OutOfMemoryError: Java heap space
  132. ExtJS 4.2.1 - Generating an Custom Theme - Error: Unknown image type 0
  133. Create all-classes.js with comments for debuging
  134. Error building my sencha touch 2 app
  135. Error when building app that was generated via Architect - phantomjs process error
  136. Sencha Cmd v4.0 RC is Now Available
  137. [FIXED] Sencha Cmd v4.0 RC problem relocating build output files
  138. [FIXED] Move .sass-cache directory location
  139. Failed to parse CSS 3.0 with CMD 3.1.2.342
  140. Sencha CMD problems...
  141. Built app that was created in architect, when running it get app.length is undefined
  142. overrides vs. app/override folder
  143. Option to fail the build if warnings are reported
  144. Remove lines from index.html after building
  145. Executing sencha minify command from build.xml
  146. Failed to load resource on using Sencha CMD
  147. Cannot run packaged Android app - Ext.logger
  148. Do I need to have the EXT (120meg) folder in each of my applications?
  149. Sencha app build production issue
  150. Using Sencha cmd with multiple page apps
  151. sencha commands 194 and sencha touch 2.3
  152. Sencha Cordova Integration Emulating & Packaging App Fails
  153. Compile cmd not including files in app.js requires
  154. Sencha cordova, unknown command.
  155. 'Stbuild.exe has stopped working' error
  156. sencha app upgrade -noframework FAILED
  157. cmd v4.161 does not copy resources data folder
  158. Sencha ant cordova-native-create-android ERROR
  159. compile -options produces error
  160. sencha cmd upgrade fails if different ext.dir in workspace sencha.cfg
  161. Sencha 4.0.0.203 Cordova/Android failures
  162. Sencha Cmd v4.0 GA is Now Available
  163. Windows 7 - Android - native not found
  164. Neptune Theme Border width - Sencha cmd 4.0.0.203 + ExtJs 4.2.2
  165. Sencha CMD refresh : activate logger
  166. Sencha Cmd path on mac
  167. So many errors on build..HELP
  168. Can't build app after upgrading from 3.1.2 to 4.0
  169. Native build errors
  170. Ruby error from app build during "Theming Ext JS" walkthrough
  171. extjs-panel-ui Causes Error with Sencha Cmd
  172. Special build for login page
  173. CMD 4 only one platform is build (phonegap.platform)
  174. CMD v4.0.0.203: app.json not found (null pointer exception)
  175. [CMD 4.0.0.203] Exclude .svn folders from build
  176. Sencha app Build package failed using Sencha CMD version 4
  177. [INF] Error: Cannot read property "build" from undefined
  178. [SOLVED]When building an app using phonegap remote build
  179. Error in sencha cmd white creating ui button "null is not a color for mix"
  180. Dynamic Requires breaking packaging of app
  181. How do I disable minify
  182. combine scss files from different folders (theme apps)
  183. Specify path to Ruby during build, when changing global system path is prohibited?
  184. Error when trying to run app: uncaught type error: object is not a function
  185. Build & upgrade error: last modified by (0.0.0.0)
  186. Ant Sencha CMD
  187. com.sencha.exceptions.ExBuild: java.lang.IllegalArgumentException on native build
  188. How to create all icons / startup images and so on from one custom logo ?
  189. How to include external JS libs/files
  190. Building with Cordova
  191. Can not get Sencha Cmd web server to start.
  192. Sencha Cmd generate app error
  193. CMD 4.0.0.203 override of sass class in app no longer works
  194. [OPEN] Bug: native iOS build contains superfluous artifacts
  195. [OPEN] Support for iOS icons seems limited?
  196. Sencha app 2.2.3 upgrade Fails
  197. compile many applications v3.1.2.342
  198. Build Fails on '-build-output-markup-page'
  199. Sencha cmd v4.0.0.203 and Sencha Touch 2.3 - Compile in wrong order
  200. [OPEN] Sencha cmd v4.0.0.203 and Sencha Touch 2.3 - Deprecated code not being removed
  201. Compile only the extjs dependencies.
  202. Found: Unknown definition for dependency : PARRENTCLASS
  203. [OPEN] [4.0.0.203] we still get the native Android TitleBar in our APKs
  204. [OPEN] Sencha command 4.0 is not generating files version on full update mode.
  205. How to open any project in Architect which has been generated by Sencha CMD?
  206. Sencha Cmd And SublimeText
  207. [OPEN] tracing compass compile during a build does not work
  208. ST2 production build app not working with error msg:Ext.application is not a function
  209. ERROR in sencha app build production
  210. [OPEN] CMD, Sencha Touch Production build
  211. How to include custom css file with Ext.js and Cmd
  212. Correct way to require files for a Sencha Cmd generated app
  213. Ant build failing: NullPointerException from <x-sencha-command>
  214. App upgrade fails
  215. Support for Cordova 3.1
  216. Package remote Repository
  217. [OPEN] [4.0.0.203] and ST2.3.0 how to get rid of the SQLCipher stuff in the APK?
  218. Cmd 4.0 does not copy symlinked resource files to build dir
  219. Sencha cmd 3.1.2 build error
  220. Error while adding Themes using Sencha CMD
  221. [FIXED] Microloader not minified after build process
  222. How do you include custom CSS files in your build?
  223. Caution before upgrading to Mavericks
  224. SenchaCmd (all versions) missing from online docs context menu
  225. Application-level SCSS without custom theme.
  226. Theming Inconsistencies in Sencha cmd 3.1.2
  227. sencha cordova init error:OS :WIN7
  228. [FIXED] document.head is undefined in IE < 9
  229. Porting a .jsb3 project to a modern sencha cmd 4.0 compatible project
  230. App works fine in development, getting a 404 in production
  231. Build in Production Mode Breaks Core Features and Layout
  232. Production build won't load socket.io - works fine in testing and regular
  233. Creating custom theme: question about variable behaviour
  234. app generate does not copy touch SDK
  235. [BUILD FAILED] Executing compass using system installed ruby runtime error
  236. Cannot build app under windows 8.1
  237. Error while adding a local package!!
  238. Upgrading packages of apps when upgrading CMD/ExtJS
  239. Sench Cmd GA compiled source error
  240. Warnings when moving build folder out of app folder
  241. Porting multiple pages (multiple user views) project to cmd structure.
  242. Framework css class missing
  243. [v4.0.0.203] Nesting Saas Variables
  244. Dynamic Index and Paths
  245. Suppress the Java stack trace after Rhino Parse Errors
  246. Can't upgrade project after upgrading sencha cmd
  247. Creation of corners image for IE on Sencha CMD 4
  248. Failed to resolve dependency Ext.Base
  249. Error executing sencha app refresh
  250. [FIXED] Include external scripts with Sencha CMD