PDA

View Full Version : SenchaSDKTools question



denisputnam
10 Feb 2013, 11:14 AM
I have downloaded and install the extjs code into /usr/local/apache-tomcat-7.0.26/ext-4.1.1a directory on my MAC. I have also installed the /Applications/SenchaSDKTools-2.0.0-beta3 tools.

I also have a directory /Users/denisputnam/www/extjs/AccountManager that would like to set up for my sencha extjs app.

When I run "sencha app create App /Users/denisputnam/www/extjs/AccountManager/App" I get,

[ERROR] The current working directory (/usr/local/apache-tomcat-7.0.26/ext-4.1.1a) is not a valid SDK directory. Please 'cd' into a SDK directory before executing this command.

What directory do I need to be in to get this to work?

StuartAshworth
10 Feb 2013, 7:20 PM
You must run the sencha create command from the main SDK directory. In your case that would be the /usr/local/apache-tomcat-7.0.26/ext-4.1.1a directory.

denisputnam
11 Feb 2013, 3:13 PM
So this is what I did. I am still getting the error. It doesn't recognize the SDK.

cd /usr/local/apache-tomcat-7.0.26/ext-4.1.1a
Deniss-MacBook-Pro:ext-4.1.1a denisputnam$ sencha
[WARN] The current working directory (/usr/local/apache-tomcat-7.0.26/ext-4.1.1a) is not a recognized Sencha SDK or application folder. Running in backwards compatible mode.


Sencha Command v2.0.0 Beta 3
Copyright (c) 2012 Sencha Inc.


usage: sencha COMMAND [ARGS]


The available commands are:
build build a JSB project
create bootstrapdata generate boostrap data
create jsb generate a minimal JSB project for an app
create locale generate a template locale file from source
create manifest generate classes manifest
package package your Touch web app into a native bundle
slice theme slice a custom theme's images for IE


See 'sencha help COMMAND' for more information on a specific command.
Deniss-MacBook-Pro:ext-4.1.1a denisputnam$ pwd
/usr/local/apache-tomcat-7.0.26/ext-4.1.1a
Deniss-MacBook-Pro:ext-4.1.1a denisputnam$ lt
total 36704
[email protected] 1 denisputnam staff 6364 Feb 10 13:56 build.xml
[email protected] 3 denisputnam staff 102 Feb 10 13:56 build/
[email protected] 1 denisputnam staff 7000 Feb 10 13:56 bootstrap.js
[email protected] 15 denisputnam staff 510 Feb 10 13:56 ../
[email protected] 3 denisputnam staff 102 Feb 10 13:56 cmd/
[email protected] 14 denisputnam staff 476 Feb 10 13:56 builds/
[email protected] 13 denisputnam staff 442 Feb 10 13:56 docs/
[email protected] 1 denisputnam staff 2945451 Feb 10 13:56 ext-all-debug.js
[email protected] 1 denisputnam staff 5489078 Feb 10 13:56 ext-all-debug-w-comments.js
[email protected] 64 denisputnam staff 2176 Feb 10 13:56 examples/
[email protected] 1 denisputnam staff 693053 Feb 10 13:56 release-notes.html*
[email protected] 8 denisputnam staff 272 Feb 10 13:56 pkgs/
[email protected] 48 denisputnam staff 1632 Feb 10 13:56 locale/
[email protected] 1 denisputnam staff 1482 Feb 10 13:56 license.txt*
[email protected] 1 denisputnam staff 5293 Feb 10 13:56 index.html*
[email protected] 1 denisputnam staff 226599 Feb 10 13:56 ext.js
[email protected] 1 denisputnam staff 16776 Feb 10 13:56 ext-neptune.js
[email protected] 1 denisputnam staff 27226 Feb 10 13:56 ext-neptune-debug.js
[email protected] 1 denisputnam staff 33959 Feb 10 13:56 ext-neptune-debug-w-comments.js
[email protected] 1 denisputnam staff 988410 Feb 10 13:56 ext-dev.js
[email protected] 1 denisputnam staff 520807 Feb 10 13:56 ext-debug.js
[email protected] 1 denisputnam staff 963874 Feb 10 13:56 ext-debug-w-comments.js
[email protected] 1 denisputnam staff 1291919 Feb 10 13:56 ext-all.js
[email protected] 1 denisputnam staff 5531086 Feb 10 13:56 ext-all-dev.js
[email protected] 5 denisputnam staff 170 Feb 10 13:56 resources/
[email protected] 5 denisputnam staff 170 Feb 10 13:56 welcome/
[email protected] 58 denisputnam staff 1972 Feb 10 13:56 src/
[email protected] 28 denisputnam staff 952 Feb 10 13:56 ./
Deniss-MacBook-Pro:ext-4.1.1a denisputnam$

mitchellsimoens
12 Feb 2013, 7:17 AM
You need to use Sencha Cmd not SDK Tools for Ext JS 4.1.1a

denisputnam
12 Feb 2013, 7:56 AM
Hi Mitchell,

When you say sencha cmd, can you be a bit more specific? Is this something I need to download? If so, can you provide me the link? If it is a specific command line syntax, can you provide me an example?

Do I need to download something different for the SDK? I am still confused.

-Denis

mitchellsimoens
12 Feb 2013, 8:02 AM
Hi Mitchell,

When you say sencha cmd, can you be a bit more specific? Is this something I need to download? If so, can you provide me the link? If it is a specific command line syntax, can you provide me an example?

Do I need to download something different for the SDK? I am still confused.

-Denis

http://www.sencha.com/forum/showthread.php?252466-Sencha-Cmd-v3.0.2-is-Now-Available

There is a whole forum for Sencha Cmd: http://www.sencha.com/forum/forumdisplay.php?8-Sencha-Cmd

denisputnam
12 Feb 2013, 9:41 AM
Okay, so I now have the Sencha Cmd. Can you point me to the link for the command line reference?

denisputnam
12 Feb 2013, 9:46 AM
I tried this:

sencha app build
Sencha Cmd v3.0.2.288
[ERR] Please ensure this command was executed from a valid application directory
[ERR] Unable to locate 'app.dir' config property from sencha.cfg
Deniss-MacBook-Pro:example denisputnam$ pwd
/usr/local/apache-tomcat-7.0.26/webapps/ROOT/denis/example
Deniss-MacBook-Pro:example denisputnam$

mitchellsimoens
12 Feb 2013, 10:44 AM
Was the app generated with Sencha Cmd...


cd /path/to/extjs-4.1.1a
sencha generate app MyApp /path/to/MyApp
cd /path/to/MyApp
sencha app build

denisputnam
12 Feb 2013, 11:07 AM
Much better. I got it to generate the app, but now I am getting this on the build:


Deniss-MacBook-Pro:MyApp denisputnam$ sencha app buildSencha Cmd v3.0.2.288
[INF]
[INF] init-properties:
[INF]
[INF] init-sencha-command:
[INF]
[INF] init:
[INF]
[INF] -before-app-build:
[INF]
[INF] app-build-impl:
[INF]
[INF] production:
[INF]
[INF] -before-init-local:
[INF]
[INF] -init-local:
[INF]
[INF] -after-init-local:
[INF]
[INF] init-local:
[INF]
[INF] find-cmd:
[INF]
[INF] -before-init:
[INF]
[INF] -init:
[INF]
[INF] -after-init:
[INF]
[INF] init:
[INF]
[INF] -before-build:
[INF]
[INF] sass:
[INF]
[INF] -before-sass:
[INF]
[INF] -sass:
[INF] [shellscript] /var/folders/qn/7z7sq6512073vmm11_p5j6t00000gn/T/script1444740027null: line 3: compass: command not found
[ERR]
[ERR] BUILD FAILED
[ERR] com.sencha.exceptions.BasicException: The following error occurred while executing this line:
[ERR] /usr/local/apache-tomcat-7.0.26/webapps/ROOT/denis/example/MyApp/.sencha/app/build-impl.xml:306: The following error occurred while executing this line:
[ERR] /usr/local/apache-tomcat-7.0.26/webapps/ROOT/denis/example/MyApp/.sencha/app/build-impl.xml:309: The following error occurred while executing this line:
[ERR] /usr/local/apache-tomcat-7.0.26/webapps/ROOT/denis/example/MyApp/.sencha/app/build-impl.xml:205: The following error occurred while executing this line:
[ERR] jar:file:/Users/denisputnam/bin/Sencha/Cmd/3.0.2.288/sencha.jar!/com/sencha/ant/antlib.xml:388: shellscript returned: 127
[ERR] at com.sencha.exceptions.BasicException.wrap(BasicException.java:43)
[ERR] at com.sencha.cli.Command.dispatch(Command.java:104)
[ERR] at com.sencha.cli.Commands.dispatch(Commands.java:49)
[ERR] at com.sencha.cli.AbstractCommand.dispatch(AbstractCommand.java:182)
[ERR] at com.sencha.ant.SenchaCommandTask.doExecute(SenchaCommandTask.java:69)
[ERR] at com.sencha.ant.BaseAntTask.execute(BaseAntTask.java:22)
[ERR] at org.apache.tools.ant.UnknownElement.execute(UnknownElement.java:291)
[ERR] at sun.reflect.NativeMethodAccessorImpl.invoke0(Native Method)
[ERR] at sun.reflect.NativeMethodAccessorImpl.invoke(NativeMethodAccessorImpl.java:57)
[ERR] at sun.reflect.DelegatingMethodAccessorImpl.invoke(DelegatingMethodAccessorImpl.java:43)
[ERR] at java.lang.reflect.Method.invoke(Method.java:601)
[ERR] at org.apache.tools.ant.dispatch.DispatchUtils.execute(DispatchUtils.java:106)
[ERR] at org.apache.tools.ant.Task.perform(Task.java:348)
[ERR] at org.apache.tools.ant.Target.execute(Target.java:392)
[ERR] at org.apache.tools.ant.Target.performTasks(Target.java:413)
[ERR] at org.apache.tools.ant.Project.executeSortedTargets(Project.java:1399)
[ERR] at org.apache.tools.ant.Project.executeTarget(Project.java:1368)
[ERR] at org.apache.tools.ant.helper.DefaultExecutor.executeTargets(DefaultExecutor.java:41)
[ERR] at org.apache.tools.ant.Project.executeTargets(Project.java:1251)
[ERR] at com.sencha.ant.AntRunner.run(AntRunner.java:156)
[ERR] at com.sencha.ant.AntRunner.run(AntRunner.java:72)
[ERR] at com.sencha.command.BasePluginCommands$BasePluginCommand.run(BasePluginCommands.java:94)
[ERR] at com.sencha.command.BasePluginCommands$BasePluginCommand.run(BasePluginCommands.java:98)
[ERR] at com.sencha.command.BasePluginCommands$BaseNamePathCommand.run(BasePluginCommands.java:142)
[ERR] at com.sencha.command.app.AppCommands$BuildCommand.execute(AppCommands.java:116)
[ERR] at sun.reflect.NativeMethodAccessorImpl.invoke0(Native Method)
[ERR] at sun.reflect.NativeMethodAccessorImpl.invoke(NativeMethodAccessorImpl.java:57)
[ERR] at sun.reflect.DelegatingMethodAccessorImpl.invoke(DelegatingMethodAccessorImpl.java:43)
[ERR] at java.lang.reflect.Method.invoke(Method.java:601)
[ERR] at com.sencha.cli.Command.dispatch(Command.java:78)
[ERR] at com.sencha.cli.Commands.dispatch(Commands.java:49)
[ERR] at com.sencha.cli.Commands.dispatch(Commands.java:49)
[ERR] at com.sencha.command.Sencha.main(Sencha.java:71)
[ERR] Caused by: /usr/local/apache-tomcat-7.0.26/webapps/ROOT/denis/example/MyApp/.sencha/app/build-impl.xml:317: The following error occurred while executing this line:
[ERR] /usr/local/apache-tomcat-7.0.26/webapps/ROOT/denis/example/MyApp/.sencha/app/build-impl.xml:306: The following error occurred while executing this line:
[ERR] /usr/local/apache-tomcat-7.0.26/webapps/ROOT/denis/example/MyApp/.sencha/app/build-impl.xml:309: The following error occurred while executing this line:
[ERR] /usr/local/apache-tomcat-7.0.26/webapps/ROOT/denis/example/MyApp/.sencha/app/build-impl.xml:205: The following error occurred while executing this line:
[ERR] jar:file:/Users/denisputnam/bin/Sencha/Cmd/3.0.2.288/sencha.jar!/com/sencha/ant/antlib.xml:388: shellscript returned: 127
[ERR] at org.apache.tools.ant.ProjectHelper.addLocationToBuildException(ProjectHelper.java:551)
[ERR] at org.apache.tools.ant.taskdefs.Ant.execute(Ant.java:444)
[ERR] at org.apache.tools.ant.taskdefs.CallTarget.execute(CallTarget.java:105)
[ERR] at org.apache.tools.ant.UnknownElement.execute(UnknownElement.java:291)
[ERR] at sun.reflect.GeneratedMethodAccessor10.invoke(Unknown Source)
[ERR] at sun.reflect.DelegatingMethodAccessorImpl.invoke(DelegatingMethodAccessorImpl.java:43)
[ERR] at java.lang.reflect.Method.invoke(Method.java:601)
[ERR] at org.apache.tools.ant.dispatch.DispatchUtils.execute(DispatchUtils.java:106)
[ERR] at org.apache.tools.ant.Task.perform(Task.java:348)
[ERR] at org.apache.tools.ant.Target.execute(Target.java:392)
[ERR] at org.apache.tools.ant.Target.performTasks(Target.java:413)
[ERR] at org.apache.tools.ant.Project.executeSortedTargets(Project.java:1399)
[ERR] at org.apache.tools.ant.Project.executeTarget(Project.java:1368)
[ERR] at org.apache.tools.ant.helper.DefaultExecutor.executeTargets(DefaultExecutor.java:41)
[ERR] at org.apache.tools.ant.Project.executeTargets(Project.java:1251)
[ERR] at com.sencha.ant.AntRunner.run(AntRunner.java:156)
[ERR] at com.sencha.ant.AntRunner.run(AntRunner.java:80)
[ERR] at com.sencha.command.ant.AntCommand.execute(AntCommand.java:75)
[ERR] at sun.reflect.NativeMethodAccessorImpl.invoke0(Native Method)
[ERR] at sun.reflect.NativeMethodAccessorImpl.invoke(NativeMethodAccessorImpl.java:57)
[ERR] at sun.reflect.DelegatingMethodAccessorImpl.invoke(DelegatingMethodAccessorImpl.java:43)
[ERR] at java.lang.reflect.Method.invoke(Method.java:601)
[ERR] at com.sencha.cli.Command.dispatch(Command.java:78)
[ERR] ... 31 more
[ERR] Caused by: /usr/local/apache-tomcat-7.0.26/webapps/ROOT/denis/example/MyApp/.sencha/app/build-impl.xml:306: The following error occurred while executing this line:
[ERR] /usr/local/apache-tomcat-7.0.26/webapps/ROOT/denis/example/MyApp/.sencha/app/build-impl.xml:309: The following error occurred while executing this line:
[ERR] /usr/local/apache-tomcat-7.0.26/webapps/ROOT/denis/example/MyApp/.sencha/app/build-impl.xml:205: The following error occurred while executing this line:
[ERR] jar:file:/Users/denisputnam/bin/Sencha/Cmd/3.0.2.288/sencha.jar!/com/sencha/ant/antlib.xml:388: shellscript returned: 127
[ERR] at org.apache.tools.ant.ProjectHelper.addLocationToBuildException(ProjectHelper.java:551)
[ERR] at org.apache.tools.ant.taskdefs.MacroInstance.execute(MacroInstance.java:401)
[ERR] at net.sf.antcontrib.logic.ForTask.doSequentialIteration(ForTask.java:259)
[ERR] at net.sf.antcontrib.logic.ForTask.doToken(ForTask.java:268)
[ERR] at net.sf.antcontrib.logic.ForTask.doTheTasks(ForTask.java:324)
[ERR] at net.sf.antcontrib.logic.ForTask.execute(ForTask.java:244)
[ERR] at org.apache.tools.ant.UnknownElement.execute(UnknownElement.java:291)
[ERR] at sun.reflect.GeneratedMethodAccessor10.invoke(Unknown Source)
[ERR] at sun.reflect.DelegatingMethodAccessorImpl.invoke(DelegatingMethodAccessorImpl.java:43)
[ERR] at java.lang.reflect.Method.invoke(Method.java:601)
[ERR] at org.apache.tools.ant.dispatch.DispatchUtils.execute(DispatchUtils.java:106)
[ERR] at org.apache.tools.ant.Task.perform(Task.java:348)
[ERR] at org.apache.tools.ant.Target.execute(Target.java:392)
[ERR] at org.apache.tools.ant.Target.performTasks(Target.java:413)
[ERR] at org.apache.tools.ant.Project.executeSortedTargets(Project.java:1399)
[ERR] at org.apache.tools.ant.helper.SingleCheckExecutor.executeTargets(SingleCheckExecutor.java:38)
[ERR] at org.apache.tools.ant.Project.executeTargets(Project.java:1251)
[ERR] at org.apache.tools.ant.taskdefs.Ant.execute(Ant.java:442)
[ERR] ... 52 more
[ERR] Caused by: /usr/local/apache-tomcat-7.0.26/webapps/ROOT/denis/example/MyApp/.sencha/app/build-impl.xml:309: The following error occurred while executing this line:
[ERR] /usr/local/apache-tomcat-7.0.26/webapps/ROOT/denis/example/MyApp/.sencha/app/build-impl.xml:205: The following error occurred while executing this line:
[ERR] jar:file:/Users/denisputnam/bin/Sencha/Cmd/3.0.2.288/sencha.jar!/com/sencha/ant/antlib.xml:388: shellscript returned: 127
[ERR] at org.apache.tools.ant.ProjectHelper.addLocationToBuildException(ProjectHelper.java:551)
[ERR] at org.apache.tools.ant.taskdefs.MacroInstance.execute(MacroInstance.java:401)
[ERR] at org.apache.tools.ant.UnknownElement.execute(UnknownElement.java:291)
[ERR] at sun.reflect.GeneratedMethodAccessor10.invoke(Unknown Source)
[ERR] at sun.reflect.DelegatingMethodAccessorImpl.invoke(DelegatingMethodAccessorImpl.java:43)
[ERR] at java.lang.reflect.Method.invoke(Method.java:601)
[ERR] at org.apache.tools.ant.dispatch.DispatchUtils.execute(DispatchUtils.java:106)
[ERR] at org.apache.tools.ant.Task.perform(Task.java:348)
[ERR] at org.apache.tools.ant.t
[ERR] askdefs.Sequential.execute(Sequential.java:68)
[ERR] at org.apache.tools.ant.UnknownElement.execute(UnknownElement.java:291)
[ERR] at sun.reflect.GeneratedMethodAccessor10.invoke(Unknown Source)
[ERR] at sun.reflect.DelegatingMethodAccessorImpl.invoke(DelegatingMethodAccessorImpl.java:43)
[ERR] at java.lang.reflect.Method.invoke(Method.java:601)
[ERR] at org.apache.tools.ant.dispatch.DispatchUtils.execute(DispatchUtils.java:106)
[ERR] at org.apache.tools.ant.Task.perform(Task.java:348)
[ERR] at org.apache.tools.ant.taskdefs.MacroInstance.execute(MacroInstance.java:398)
[ERR] ... 68 more
[ERR] Caused by: /usr/local/apache-tomcat-7.0.26/webapps/ROOT/denis/example/MyApp/.sencha/app/build-impl.xml:205: The following error occurred while executing this line:
[ERR] jar:file:/Users/denisputnam/bin/Sencha/Cmd/3.0.2.288/sencha.jar!/com/sencha/ant/antlib.xml:388: shellscript returned: 127
[ERR] at org.apache.tools.ant.ProjectHelper.addLocationToBuildException(ProjectHelper.java:551)
[ERR] at org.apache.tools.ant.taskdefs.MacroInstance.execute(MacroInstance.java:401)
[ERR] at org.apache.tools.ant.UnknownElement.execute(UnknownElement.java:291)
[ERR] at sun.reflect.GeneratedMethodAccessor10.invoke(Unknown Source)
[ERR] at sun.reflect.DelegatingMethodAccessorImpl.invoke(DelegatingMethodAccessorImpl.java:43)
[ERR] at java.lang.reflect.Method.invoke(Method.java:601)
[ERR] at org.apache.tools.ant.dispatch.DispatchUtils.execute(DispatchUtils.java:106)
[ERR] at org.apache.tools.ant.Task.perform(Task.java:348)
[ERR] at org.apache.tools.ant.taskdefs.Sequential.execute(Sequential.java:68)
[ERR] at org.apache.tools.ant.UnknownElement.execute(UnknownElement.java:291)
[ERR] at sun.reflect.GeneratedMethodAccessor10.invoke(Unknown Source)
[ERR] at sun.reflect.DelegatingMethodAccessorImpl.invoke(DelegatingMethodAccessorImpl.java:43)
[ERR] at java.lang.reflect.Method.invoke(Method.java:601)
[ERR] at org.apache.tools.ant.dispatch.DispatchUtils.execute(DispatchUtils.java:106)
[ERR] at org.apache.tools.ant.Task.perform(Task.java:348)
[ERR] at org.apache.tools.ant.taskdefs.MacroInstance.execute(MacroInstance.java:398)
[ERR] ... 82 more
[ERR] Caused by: jar:file:/Users/denisputnam/bin/Sencha/Cmd/3.0.2.288/sencha.jar!/com/sencha/ant/antlib.xml:388: shellscript returned: 127
[ERR] at org.apache.tools.ant.taskdefs.ExecTask.runExecute(ExecTask.java:646)
[ERR] at org.apache.tools.ant.taskdefs.ExecTask.runExec(ExecTask.java:672)
[ERR] at org.apache.tools.ant.taskdefs.ExecTask.execute(ExecTask.java:498)
[ERR] at net.sf.antcontrib.platform.ShellScriptTask.execute(ShellScriptTask.java:132)
[ERR] at org.apache.tools.ant.UnknownElement.execute(UnknownElement.java:291)
[ERR] at sun.reflect.GeneratedMethodAccessor10.invoke(Unknown Source)
[ERR] at sun.reflect.DelegatingMethodAccessorImpl.invoke(DelegatingMethodAccessorImpl.java:43)
[ERR] at java.lang.reflect.Method.invoke(Method.java:601)
[ERR] at org.apache.tools.ant.dispatch.DispatchUtils.execute(DispatchUtils.java:106)
[ERR] at org.apache.tools.ant.Task.perform(Task.java:348)
[ERR] at org.apache.tools.ant.taskdefs.Sequential.execute(Sequential.java:68)
[ERR] at net.sf.antcontrib.logic.IfTask.execute(IfTask.java:197)
[ERR] at sun.reflect.NativeMethodAccessorImpl.invoke0(Native Method)
[ERR] at sun.reflect.NativeMethodAccessorImpl.invoke(NativeMethodAccessorImpl.java:57)
[ERR] at sun.reflect.DelegatingMethodAccessorImpl.invoke(DelegatingMethodAccessorImpl.java:43)
[ERR] at java.lang.reflect.Method.invoke(Method.java:601)
[ERR] at org.apache.tools.ant.dispatch.DispatchUtils.execute(DispatchUtils.java:106)
[ERR] at org.apache.tools.ant.TaskAdapter.execute(TaskAdapter.java:154)
[ERR] at org.apache.tools.ant.UnknownElement.execute(UnknownElement.java:291)
[ERR] at sun.reflect.GeneratedMethodAccessor10.invoke(Unknown Source)
[ERR] at sun.reflect.DelegatingMethodAccessorImpl.invoke(DelegatingMethodAccessorImpl.java:43)
[ERR] at java.lang.reflect.Method.invoke(Method.java:601)
[ERR] at org.apache.tools.ant.dispatch.DispatchUtils.execute(DispatchUtils.java:106)
[ERR] at org.apache.tools.ant.Task.perform(Task.java:348)
[ERR] at org.apache.tools.ant.taskdefs.Sequential.execute(Sequential.java:68)
[ERR] at net.sf.antcontrib.logic.IfTask.execute(IfTask.java:217)
[ERR] at sun.reflect.NativeMethodAccessorImpl.invoke0(Native Method)
[ERR] at sun.reflect.NativeMethodAccessorImpl.invoke(NativeMethodAccessorImpl.java:57)
[ERR] at sun.reflect.DelegatingMethodAccessorImpl.invoke(DelegatingMethodAccessorImpl.java:43)
[ERR] at java.lang.reflect.Method.invoke(Method.java:601)
[ERR] at org.apache.tools.ant.dispatch.DispatchUtils.execute(DispatchUtils.java:106)
[ERR] at org.apache.tools.ant.TaskAdapter.execute(TaskAdapter.java:154)
[ERR] at org.apache.tools.ant.UnknownElement.execute(UnknownElement.java:291)
[ERR] at sun.reflect.GeneratedMethodAccessor10.invoke(Unknown Source)
[ERR] at sun.reflect.DelegatingMethodAccessorImpl.invoke(DelegatingMethodAccessorImpl.java:43)
[ERR] at java.lang.reflect.Method.invoke(Method.java:601)
[ERR] at org.apache.tools.ant.dispatch.DispatchUtils.execute(DispatchUtils.java:106)
[ERR] at org.apache.tools.ant.Task.perform(Task.java:348)
[ERR] at org.apache.tools.ant.taskdefs.Sequential.execute(Sequential.java:68)
[ERR] at org.apache.tools.ant.UnknownElement.execute(UnknownElement.java:291)
[ERR] at sun.reflect.GeneratedMethodAccessor10.invoke(Unknown Source)
[ERR] at sun.reflect.DelegatingMethodAccessorImpl.invoke(DelegatingMethodAccessorImpl.java:43)
[ERR] at java.lang.reflect.Method.invoke(Method.java:601)
[ERR] at org.apache.tools.ant.dispatch.DispatchUtils.execute(DispatchUtils.java:106)
[ERR] at org.apache.tools.ant.Task.perform(Task.java:348)
[ERR] at org.apache.tools.ant.taskdefs.MacroInstance.execute(MacroInstance.java:398)
[ERR] ... 96 more
[ERR]
[ERR] Total time: 2 seconds
[ERR] com.sencha.exceptions.BasicException: The following error occurred while executing this line:
/usr/local/apache-tomcat-7.0.26/webapps/ROOT/denis/example/MyApp/.sencha/app/build-impl.xml:306: The following error occurred while executing this line:
/usr/local/apache-tomcat-7.0.26/webapps/ROOT/denis/example/MyApp/.sencha/app/build-impl.xml:309: The following error occurred while executing this line:
/usr/local/apache-tomcat-7.0.26/webapps/ROOT/denis/example/MyApp/.sencha/app/build-impl.xml:205: The following error occurred while executing this line:
jar:file:/Users/denisputnam/bin/Sencha/Cmd/3.0.2.288/sencha.jar!/com/sencha/ant/antlib.xml:388: shellscript returned: 127
Deniss-MacBook-Pro:MyApp denisputnam$

mitchellsimoens
12 Feb 2013, 11:26 AM
Something that was lacking with SDK Tools is that it didn't handle the SASS and now that we are in a defined application structure SASS is part of that. SO to go without error you would need to install compass, you can see more in this guide: http://docs.sencha.com/ext-js/4-1/#!/guide/theming