Results 1 to 4 of 4

Thread: Upgraded to 2.2.0, build now fails

  1. #1
    Sencha User
    Join Date
    Jul 2012
    Posts
    30
    Answers
    1
    Vote Rating
    0
      0  

    Default Upgraded to 2.2.0, build now fails

    I upgraded my Sencha Tools to 3.1.1.274 and also upgraded my project to 2.2.0 and now I am unable to build using the "sencha app build package" command. The first error that is thrown is

    Code:
    [ERR] BUILD FAILED
    [ERR] com.sencha.exceptions.ExProcess: compass process exited with non-zero code : 1
    And here is the entire output of the build command

    Code:
    localhost:Cox7Arizona sogorman$ sencha app build package
    Sencha Cmd v3.1.1.274
    [INF] 
    [INF] init-plugin:
    [INF] 
    [INF] init-plugin:
    [INF] 
    [INF] -before-app-build:
    [INF] 
    [INF] cmd-root-plugin.init-properties:
    [INF] 
    [INF] init-properties:
    [INF] 
    [INF] init-sencha-command:
    [INF] 
    [INF] init:
    [INF] 
    [INF] -before-app-build:
    [INF] 
    [INF] app-build-impl:
    [INF] 
    [INF] package:
    [INF] 
    [INF] -before-init-local:
    [INF] 
    [INF] -init-local:
    [INF] 
    [INF] -after-init-local:
    [INF] 
    [INF] init-local:
    [INF] 
    [INF] find-cmd:
    [INF] 
    [INF] -before-init:
    [INF] 
    [INF] -init:
    [INF] Initializing Sencha Cmd ant environment
    [INF] Adding antlib taskdef for com/sencha/command/compass/ant/antlib.xml
    [INF] 
    [INF] -after-init:
    [INF] 
    [INF] init:
    [INF] 
    [INF] -before-build:
    [INF] 
    [INF] sass:
    [INF] 
    [INF] -before-sass:
    [INF] 
    [INF] -sass:
    [INF] executing compass using system installed ruby runtime
    File not found or cannot be read: /Users/sogorman/Developer/Projects/Cox7Arizona/resources/sass/stylesheets/fonts/pictos/pictos-web.woff
    [ERR] 
    [ERR] BUILD FAILED
    [ERR] com.sencha.exceptions.ExProcess: compass process exited with non-zero code : 1
    [ERR] 
    [ERR] Total time: 0 seconds
    [ERR] 
    [ERR] BUILD FAILED
    [ERR] com.sencha.exceptions.BasicException: The following error occurred while executing this line:
    [ERR] /Users/sogorman/Developer/Projects/Cox7Arizona/.sencha/app/build-impl.xml:223: com.sencha.exceptions.ExProcess: compass process exited with non-zero code : 1
    [ERR] 
    [ERR] Total time: 1 second
    [ERR] com.sencha.exceptions.BasicException: The following error occurred while executing this line:
    /Users/sogorman/Developer/Projects/Cox7Arizona/.sencha/app/build-impl.xml:223: com.sencha.exceptions.ExProcess: compass process exited with non-zero code : 1

    I have done some reading but am unable to resolve the compass issue :/

  2. #2
    Sencha User
    Join Date
    Feb 2013
    Posts
    14
    Vote Rating
    0
      0  

    Default

    copy the directory touch/resources/themes/fonts to resources/sass/stylesheets/

  3. #3
    Sencha User
    Join Date
    Oct 2012
    Posts
    9
    Vote Rating
    1
      0  

    Default Solved?

    Is this problem solved yet? I have the same problem.

  4. #4
    Sencha User
    Join Date
    Feb 2013
    Posts
    14
    Vote Rating
    0
      0  

    Default

    Have you tried my suggestion? I've had the same problem in the past and got it working that way.

Posting Permissions

  • You may not post new threads
  • You may not post replies
  • You may not post attachments
  • You may not edit your posts
  •