Results 1 to 9 of 9

Thread: sencha commands 194 and sencha touch 2.3

  1. #1
    Sencha User
    Join Date
    May 2012
    Location
    Colombia
    Posts
    46

    Default sencha commands 194 and sencha touch 2.3

    I updated sencha commands today to v4.0.0.194
    Downloaded sencha touch beta 2.3
    generated a new app
    Copied my sencha touch 2.2.1 app dir to a new app 2.3 dir
    Tried to package and get this error
    Thank you

    Code:
    [INF] -compile-resources:
    [INF] merging resources into /Users/alexesc/Sites/hydroappsandroid/canalestouch2.3/build/native/canales/resources
    [INF] merged 0 resources into /Users/alexesc/Sites/hydroappsandroid/canalestouch2.3/build/native/canales/resources
    [ERR] 
    [ERR] BUILD FAILED
    [ERR] java.lang.NullPointerException
    [ERR] 
    [ERR] Total time: 9 seconds
    [ERR] The following error occurred while executing this line:
    /Users/alexesc/Sites/hydroappsandroid/canalestouch2.3/.sencha/app/resources-impl.xml:7: java.lang.NullPointerException
         at org.apache.tools.ant.ProjectHelper.addLocationToBuildException(ProjectHelper.java:551)
         at org.apache.tools.ant.taskdefs.Ant.execute(Ant.java:444)

  2. #2
    Sencha User dongryphon's Avatar
    Join Date
    Jul 2009
    Location
    Kansas
    Posts
    1,748

    Default

    Can you provide the exact command and complete log?

    FYI - build 194 was pushed to CDN but no release announcement and subsequently removed ... so it is somewhere between RC and GA. The GA is due any day now. Apologies for any confusion there.
    Don Griffin

    "Use the source, Luke!"

  3. #3
    Sencha User
    Join Date
    May 2012
    Location
    Colombia
    Posts
    46

    Default

    Now I have Sencha Cmd v4.0.0.161. I have an error something similar


    Sencha Cmd v4.0.0.161
    [INF]
    [INF] init-plugin:
    [INF]
    [INF] cmd-root-plugin.init-properties:
    [INF]
    [INF] init-properties:
    [INF]
    [INF] init-sencha-command:
    [INF]
    [INF] init:
    [INF]
    [INF] app-build-impl:
    [INF]
    [INF] -before-init-local:
    [INF]
    [INF] -init-local:
    [INF]
    [INF] -after-init-local:
    [INF]
    [INF] init-local:
    [INF]
    [INF] check-cmd-in-path:
    [INF]
    [INF] find-cmd-in-path:
    [INF]
    [INF] check-cmd-in-environment:
    [INF]
    [INF] find-cmd-in-environment:
    [INF]
    [INF] find-cmd-in-shell:
    [INF]
    [INF] init-cmd:
    [INF] [echo] Using Sencha Cmd from /Users/alexesc/bin/Sencha/Cmd/4.0.0.161 for /Users/alexesc/Sites/touch2.3/build.xml
    [INF]
    [INF] -before-init:
    [INF]
    [INF] -init:
    [INF] Initializing Sencha Cmd ant environment
    [INF] Adding antlib taskdef for com/sencha/command/compass/ant/antlib.xml
    [INF]
    [INF] -after-init:
    [INF]
    [INF] -before-init-defaults:
    [INF]
    [INF] -init-defaults:
    [INF]
    [INF] -after-init-defaults:
    [INF]
    [INF] -init-compiler:
    [INF]
    [INF] init:
    [INF]
    [INF] -before-build:
    [INF]
    [INF] refresh:
    [INF]
    [INF] -before-refresh:
    [INF]
    [INF] -init:
    [INF]
    [INF] -init-compiler:
    [INF]
    [INF] -detect-app-build-properties:
    [INF] Loading app json manifest...
    [INF] Loading classpath entry /Users/alexesc/Sites/touch2.3/touch/src
    [INF] Loading classpath entry /Users/alexesc/Sites/touch2.3/app.js
    [INF] Loading classpath entry /Users/alexesc/Sites/touch2.3/app
    [INF] Loading classpath entry /Users/alexesc/Sites/touch2.3/build/temp/native/canales/sencha-compiler/app
    [INF] Adding external reference : @full-page => @overrides
    [WRN] C1010: External Requirement had no matching files (@overrides) -- unknown-file:-1
    [WRN] C1010: External Requirement had no matching files (@overrides) -- unknown-file:-1
    [INF]
    [INF] -refresh-app:
    [INF] Appending concatenated output to file /Users/alexesc/Sites/touch2.3/bootstrap.js
    [INF] Appending concatenated output to file /Users/alexesc/Sites/touch2.3/bootstrap.js
    [INF] Appending concatenated output to file /Users/alexesc/Sites/touch2.3/bootstrap.js
    [INF] Appending concatenated output to file /Users/alexesc/Sites/touch2.3/bootstrap.js
    [INF] Appending content to /Users/alexesc/Sites/touch2.3/bootstrap.json
    [INF]
    [INF] -refresh:
    [INF]
    [INF] -after-refresh:
    [INF]
    [INF] resolve:
    [INF]
    [INF] js:
    [INF]
    [INF] -before-js:
    [INF]
    [INF] -init:
    [INF]
    [INF] -init-compiler:
    [INF]
    [INF] -detect-app-build-properties:
    [INF]
    [INF] -compile-js:
    [INF] Compressing data with YuiJavascriptCompressor
    [INF] Concatenating output to file /Users/alexesc/Sites/touch2.3/build/native/canales/app.js
    [INF]
    [INF] -js:
    [INF]
    [INF] -after-js:
    [INF]
    [INF] copy-resources:
    [INF]
    [INF] -before-inherit-resources:
    [INF]
    [INF] -before-copy-resources:
    [INF]
    [INF] -init:
    [INF]
    [INF] -init-compiler:
    [INF]
    [INF] -compile-resources:
    [INF] merging resources into /Users/alexesc/Sites/touch2.3/build/native/canales/resources
    [INF] merged 132 resources into /Users/alexesc/Sites/touch2.3/build/native/canales/resources
    [INF]
    [INF] -after-copy-resources:
    [INF]
    [INF] -after-inherit-resources:
    [INF]
    [INF] sass:
    [INF]
    [INF] -before-sass:
    [INF]
    [INF] -compass-compile-theme-package:
    [INF]
    [INF] -compass-compile-theme-folders:
    [INF]
    [INF] -compass-compile-sass-dir:
    [INF] executing compass using system installed ruby runtime
    identical ../css/app.css
    [INF]
    [INF] -compass-compile:
    [INF]
    [INF] -sass:
    [INF]
    [INF] -after-sass:
    [INF]
    [INF] slice:
    [INF]
    [INF] -before-slice:
    [INF]
    [INF] -slice-images:
    [INF]
    [INF] -slice:
    [INF]
    [INF] -after-slice:
    [INF]
    [INF] page:
    [INF]
    [INF] -before-page:
    [INF]
    [INF] -init:
    [INF]
    [INF] -init-compiler:
    [INF]
    [INF] -copy-app-resources:
    [INF] Copying page resources to /Users/alexesc/Sites/touch2.3/build/native/canales
    [INF] copying /Users/alexesc/Sites/touch2.3/resources/css/app.css to /Users/alexesc/Sites/touch2.3/build/native/canales/resources/css/app.css
    [INF]
    [INF] -generate-deltas:
    [INF]
    [INF] -detect-app-build-properties:
    [INF]
    [INF] -build-output-page:
    [INF]
    [INF] -build-output-microload-page:
    [INF] Writing content to /Users/alexesc/Sites/touch2.3/build/native/canales/microloader.js
    [INF] Appending content to /Users/alexesc/Sites/touch2.3/build/native/canales/microloader.js
    [INF] Building output markup to /Users/alexesc/Sites/touch2.3/build/native/canales/index.html
    [INF] [delete] Deleting: /Users/alexesc/Sites/touch2.3/build/native/canales/microloader.js
    [INF]
    [INF] -generate-cache-manifest:
    [INF]
    [INF] -page:
    [INF]
    [INF] -after-page:
    [INF]
    [INF] native-package:
    [INF]
    [INF] -before-native-package:
    [INF]
    [INF] -native-package:
    [INF]
    [INF] -native-package-mobile:
    [INF] [echo] Building all specified mobile packager configs.
    [ERR]
    [ERR] BUILD FAILED
    [ERR] com.google.gson.JsonSyntaxException: com.google.gson.stream.MalformedJsonException: Expected ''':''' at line 2 column 10
    [ERR] at java.lang.reflect.Method.invoke
    [ERR] (Method.java:597)
    [ERR]
    [ERR] Total time: 18 seconds
    [ERR] The following error occurred while executing this line:
    /Users/alexesc/Sites/touch2.3/.sencha/app/build-impl.xml:414: The following error occurred while executing this line:
    /Users/alexesc/Sites/touch2.3/.sencha/app/packager-impl.xml:124: The following error occurred while executing this line:
    /Users/alexesc/Sites/touch2.3/.sencha/app/packager-impl.xml:112: The following error occurred while executing this line:
    /Users/alexesc/Sites/touch2.3/.sencha/app/packager-impl.xml:114: The following error occurred while executing this line:
    /Users/alexesc/Sites/touch2.3/.sencha/app/packager-impl.xml:60: com.google.gson.JsonSyntaxException: com.google.gson.stream.MalformedJsonException: Expected ':' at line 2 column 10
    at org.apache.tools.ant.ProjectHelper.addLocationToBuildException(ProjectHelper.java:551)
    at org.apache.tools.ant.taskdefs.Ant.execute(Ant.java:444)
    at org.apache.tools.ant.UnknownElement.execute(UnknownElement.java:291)
    at sun.reflect.NativeMethodAccessorImpl.invoke0(Native Method)
    at sun.reflect.NativeMethodAccessorImpl.invoke(NativeMethodAccessorImpl.java:39)
    at sun.reflect.DelegatingMethodAccessorImpl.invoke(DelegatingMethodAccessorImpl.java:25)
    at java.lang.reflect.Method.invoke(Method.java:597)
    at org.apache.tools.ant.dispatch.DispatchUtils.execute(DispatchUtils.java:106)
    at org.apache.tools.ant.Task.perform(Task.java:348)
    at org.apache.tools.ant.Target.execute(Target.java:392)
    at org.apache.tools.ant.Target.performTasks(Target.java:413)
    at org.apache.tools.ant.Project.executeSortedTargets(Project.java:1399)
    at org.apache.tools.ant.Project.executeTarget(Project.java:1368)
    at org.apache.tools.ant.helper.DefaultExecutor.executeTargets(DefaultExecutor.java:41)
    at org.apache.tools.ant.Project.executeTargets(Project.java:1251)
    at com.sencha.ant.AntScript.execute(AntScript.java:127)
    at com.sencha.command.plugin.PluginManager.execute(PluginManager.java:93)
    at com.sencha.command.plugin.PluginManager.executeReverseFirst(PluginManager.java:134)
    at com.sencha.command.environment.BuildEnvironment.execute(BuildEnvironment.java:245)
    at com.sencha.command.environment.AppOrPackageEnvironment.execute(AppOrPackageEnvironment.java:394)
    at com.sencha.command.BasePluginCommands$BasePluginCommand.doExecute(BasePluginCommands.java:23)
    at com.sencha.command.app.AppCommands$BuildCommand.execute(AppCommands.java:130)
    at sun.reflect.NativeMethodAccessorImpl.invoke0(Native Method)
    at sun.reflect.NativeMethodAccessorImpl.invoke(NativeMethodAccessorImpl.java:39)
    at sun.reflect.DelegatingMethodAccessorImpl.invoke(DelegatingMethodAccessorImpl.java:25)
    at java.lang.reflect.Method.invoke(Method.java:597)
    at com.sencha.util.MethodInvoker$Arguments.invoke(MethodInvoker.java:174)
    at com.sencha.cli.Command.dispatch(Command.java:42)
    at com.sencha.cli.Commands.dispatch(Commands.java:62)
    at com.sencha.cli.Commands.dispatch(Commands.java:62)
    at com.sencha.command.Sencha.dispatch(Sencha.java:79)
    at com.sencha.command.Sencha.main(Sencha.java:147)
    Caused by: The following error occurred while executing this line:
    /Users/alexesc/Sites/touch2.3/.sencha/app/packager-impl.xml:124: The following error occurred while executing this line:
    /Users/alexesc/Sites/touch2.3/.sencha/app/packager-impl.xml:112: The following error occurred while executing this line:
    /Users/alexesc/Sites/touch2.3/.sencha/app/packager-impl.xml:114: The following error occurred while executing this line:
    /Users/alexesc/Sites/touch2.3/.sencha/app/packager-impl.xml:60: com.google.gson.JsonSyntaxException: com.google.gson.stream.MalformedJsonException: Expected ':' at line 2 column 10
    at org.apache.tools.ant.ProjectHelper.addLocationToBuildException(ProjectHelper.java:551)
    at org.apache.tools.ant.taskdefs.Ant.execute(Ant.java:444)
    at org.apache.tools.ant.taskdefs.CallTarget.execute(CallTarget.java:105)
    at com.sencha.ant.CallTask.execute(CallTask.java:108)
    at org.apache.tools.ant.UnknownElement.execute(UnknownElement.java:291)
    at sun.reflect.GeneratedMethodAccessor21.invoke(Unknown Source)
    at sun.reflect.DelegatingMethodAccessorImpl.invoke(DelegatingMethodAccessorImpl.java:25)
    at java.lang.reflect.Method.invoke(Method.java:597)
    at org.apache.tools.ant.dispatch.DispatchUtils.execute(DispatchUtils.java:106)
    at org.apache.tools.ant.Task.perform(Task.java:348)
    at org.apache.tools.ant.Target.execute(Target.java:392)
    at org.apache.tools.ant.Target.performTasks(Target.java:413)
    at org.apache.tools.ant.Project.executeSortedTargets(Project.java:1399)
    at org.apache.tools.ant.helper.SingleCheckExecutor.executeTargets(SingleCheckExecutor.java:38)
    at org.apache.tools.ant.Project.executeTargets(Project.java:1251)
    at org.apache.tools.ant.taskdefs.Ant.execute(Ant.java:442)
    at org.apache.tools.ant.UnknownElement.execute(UnknownElement.java:291)
    at sun.reflect.NativeMethodAccessorImpl.invoke0(Native Method)
    at sun.reflect.NativeMethodAccessorImpl.invoke(NativeMethodAccessorImpl.java:39)
    at sun.reflect.DelegatingMethodAccessorImpl.invoke(DelegatingMethodAccessorImpl.java:25)
    at java.lang.reflect.Method.invoke(Method.java:597)
    at org.apache.tools.ant.dispatch.DispatchUtils.execute(DispatchUtils.java:106)
    at org.apache.tools.ant.Task.perform(Task.java:348)
    at org.apache.tools.ant.Target.execute(Target.java:392)
    at org.apache.tools.ant.Target.performTasks(Target.java:413)
    at org.apache.tools.ant.Project.executeSortedTargets(Project.java:1399)
    at org.apache.tools.ant.Project.executeTarget(Project.java:1368)
    at org.apache.tools.ant.helper.DefaultExecutor.executeTargets(DefaultExecutor.java:41)
    at org.apache.tools.ant.Project.executeTargets(Project.java:1251)
    at com.sencha.ant.AntScript.execute(AntScript.java:127)
    at com.sencha.command.plugin.PluginManager.execute(PluginManager.java:93)
    at com.sencha.command.plugin.PluginManager.executeReverseFirst(PluginManager.java:134)
    at com.sencha.command.environment.BuildEnvironment.execute(BuildEnvironment.java:245)
    at com.sencha.command.environment.AppOrPackageEnvironment.execute(AppOrPackageEnvironment.java:394)
    at com.sencha.command.BasePluginCommands$BasePluginCommand.doExecute(BasePluginCommands.java:23)
    at com.sencha.command.app.AppCommands$BuildCommand.execute(AppCommands.java:130)
    at sun.reflect.NativeMethodAccessorImpl.invoke0(Native Method)
    at sun.reflect.NativeMethodAccessorImpl.invoke(NativeMethodAccessorImpl.java:39)
    at sun.reflect.DelegatingMethodAccessorImpl.invoke(DelegatingMethodAccessorImpl.java:25)
    at java.lang.reflect.Method.invoke(Method.java:597)
    at com.sencha.util.MethodInvoker$Arguments.invoke(MethodInvoker.java:174)
    at com.sencha.cli.Command.dispatch(Command.java:42)
    at com.sencha.cli.Commands.dispatch(Commands.java:62)
    at com.sencha.cli.Commands.dispatch(Commands.java:62)
    at com.sencha.command.Sencha.dispatch(Sencha.java:79)
    at com.sencha.command.Sencha.main(Sencha.java:147)
    Caused by: The following error occurred while executing this line:
    /Users/alexesc/Sites/touch2.3/.sencha/app/packager-impl.xml:112: The following error occurred while executing this line:
    /Users/alexesc/Sites/touch2.3/.sencha/app/packager-impl.xml:114: The following error occurred while executing this line:
    /Users/alexesc/Sites/touch2.3/.sencha/app/packager-impl.xml:60: com.google.gson.JsonSyntaxException: com.google.gson.stream.MalformedJsonException: Expected ':' at line 2 column 10
    at org.apache.tools.ant.ProjectHelper.addLocationToBuildException(ProjectHelper.java:551)
    at org.apache.tools.ant.taskdefs.Ant.execute(Ant.java:444)
    at org.apache.tools.ant.taskdefs.CallTarget.execute(CallTarget.java:105)
    at com.sencha.ant.CallTask.execute(CallTask.java:108)
    at org.apache.tools.ant.UnknownElement.execute(UnknownElement.java:291)
    at sun.reflect.GeneratedMethodAccessor21.invoke(Unknown Source)
    at sun.reflect.DelegatingMethodAccessorImpl.invoke(DelegatingMethodAccessorImpl.java:25)
    at java.lang.reflect.Method.invoke(Method.java:597)
    at org.apache.tools.ant.dispatch.DispatchUtils.execute(DispatchUtils.java:106)
    at org.apache.tools.ant.Task.perform(Task.java:348)
    at org.apache.tools.ant.Target.execute(Target.java:392)
    at org.apache.tools.ant.Target.performTasks(Target.java:413)
    at org.apache.tools.ant.Project.executeSortedTargets(Project.java:1399)
    at org.apache.tools.ant.helper.SingleCheckExecutor.executeTargets(SingleCheckExecutor.java:38)
    at org.apache.tools.ant.Project.executeTargets(Project.java:1251)
    at org.apache.tools.ant.taskdefs.Ant.execute(Ant.java:442)
    at org.apache.tools.ant.taskdefs.CallTarget.execute(CallTarget.java:105)
    at com.sencha.ant.CallTask.execute(CallTask.java:108)
    at org.apache.tools.ant.UnknownElement.execute(UnknownElement.java:291)
    at sun.reflect.GeneratedMethodAccessor21.invoke(Unknown Source)
    at sun.reflect.DelegatingMethodAccessorImpl.invoke(DelegatingMethodAccessorImpl.java:25)
    at java.lang.reflect.Method.invoke(Method.java:597)
    at org.apache.tools.ant.dispatch.DispatchUtils.execute(DispatchUtils.java:106)
    at org.apache.tools.ant.Task.perform(Task.java:348)
    at org.apache.tools.ant.Target.execute(Target.java:392)
    at org.apache.tools.ant.Target.performTasks(Target.java:413)
    at org.apache.tools.ant.Project.executeSortedTargets(Project.java:1399)
    at org.apache.tools.ant.helper.SingleCheckExecutor.executeTargets(SingleCheckExecutor.java:38)
    at org.apache.tools.ant.Project.executeTargets(Project.java:1251)
    at org.apache.tools.ant.taskdefs.Ant.execute(Ant.java:442)
    at org.apache.tools.ant.UnknownElement.execute(UnknownElement.java:291)
    at sun.reflect.NativeMethodAccessorImpl.invoke0(Native Method)
    at sun.reflect.NativeMethodAccessorImpl.invoke(NativeMethodAccessorImpl.java:39)
    at sun.reflect.DelegatingMethodAccessorImpl.invoke(DelegatingMethodAccessorImpl.java:25)
    at java.lang.reflect.Method.invoke(Method.java:597)
    at org.apache.tools.ant.dispatch.DispatchUtils.execute(DispatchUtils.java:106)
    at org.apache.tools.ant.Task.perform(Task.java:348)
    at org.apache.tools.ant.Target.execute(Target.java:392)
    at org.apache.tools.ant.Target.performTasks(Target.java:413)
    at org.apache.tools.ant.Project.executeSortedTargets(Project.java:1399)
    at org.apache.tools.ant.Project.executeTarget(Project.java:1368)
    at org.apache.tools.ant.helper.DefaultExecutor.executeTargets(DefaultExecutor.java:41)
    at org.apache.tools.ant.Project.executeTargets(Project.java:1251)
    at com.sencha.ant.AntScript.execute(AntScript.java:127)
    at com.sencha.command.plugin.PluginManager.execute(PluginManager.java:93)
    at com.sencha.command.plugin.PluginManager.executeReverseFirst(PluginManager.java:134)
    at com.sencha.command.environment.BuildEnvironment.execute(BuildEnvironment.java:245)
    at com.sencha.command.environment.AppOrPackageEnvironment.execute(AppOrPackageEnvironment.java:394)
    at com.sencha.command.BasePluginCommands$BasePluginCommand.doExecute(BasePluginCommands.java:23)
    at com.sencha.command.app.AppCommands$BuildCommand.execute(AppCommands.java:130)
    at sun.reflect.NativeMethodAccessorImpl.invoke0(Native Method)
    at sun.reflect.NativeMethodAccessorImpl.invoke(NativeMethodAccessorImpl.java:39)
    at sun.reflect.DelegatingMethodAccessorImpl.invoke(DelegatingMethodAccessorImpl.java:25)
    at java.lang.reflect.Method.invoke(Method.java:597)
    at com.sencha.util.MethodInvoker$Arguments.invoke(MethodInvoker.java:174)
    at com.sencha.cli.Command.dispatch(Command.java:42)
    at com.sencha.cli.Commands.dispatch(Commands.java:62)
    at com.sencha.cli.Commands.dispatch(Commands.java:62)
    at com.sencha.command.Sencha.dispatch(Sencha.java:79)
    at com.sencha.command.Sencha.main(Sencha.java:147)
    Caused by: The following error occurred while executing this line:
    /Users/alexesc/Sites/touch2.3/.sencha/app/packager-impl.xml:114: The following error occurred while executing this line:
    /Users/alexesc/Sites/touch2.3/.sencha/app/packager-impl.xml:60: com.google.gson.JsonSyntaxException: com.google.gson.stream.MalformedJsonException: Expected ':' at line 2 column 10
    at org.apache.tools.ant.ProjectHelper.addLocationToBuildException(ProjectHelper.java:551)
    at org.apache.tools.ant.taskdefs.MacroInstance.execute(MacroInstance.java:401)
    at net.sf.antcontrib.logic.ForTask.doSequentialIteration(ForTask.java:259)
    at net.sf.antcontrib.logic.ForTask.doToken(ForTask.java:268)
    at net.sf.antcontrib.logic.ForTask.doTheTasks(ForTask.java:299)
    at net.sf.antcontrib.logic.ForTask.execute(ForTask.java:244)
    at org.apache.tools.ant.UnknownElement.execute(UnknownElement.java:291)
    at sun.reflect.GeneratedMethodAccessor21.invoke(Unknown Source)
    at sun.reflect.DelegatingMethodAccessorImpl.invoke(DelegatingMethodAccessorImpl.java:25)
    at java.lang.reflect.Method.invoke(Method.java:597)
    at org.apache.tools.ant.dispatch.DispatchUtils.execute(DispatchUtils.java:106)
    at org.apache.tools.ant.Task.perform(Task.java:348)
    at org.apache.tools.ant.taskdefs.Sequential.execute(Sequential.java:68)
    at net.sf.antcontrib.logic.IfTask.execute(IfTask.java:217)
    at sun.reflect.GeneratedMethodAccessor50.invoke(Unknown Source)
    at sun.reflect.DelegatingMethodAccessorImpl.invoke(DelegatingMethodAccessorImpl.java:25)
    at java.lang.reflect.Method.invoke(Method.java:597)
    at org.apache.tools.ant.dispatch.DispatchUtils.execute(DispatchUtils.java:106)
    at org.apache.tools.ant.TaskAdapter.execute(TaskAdapter.java:154)
    at org.apache.tools.ant.UnknownElement.execute(UnknownElement.java:291)
    at sun.reflect.GeneratedMethodAccessor21.invoke(Unknown Source)
    at sun.reflect.DelegatingMethodAccessorImpl.invoke(DelegatingMethodAccessorImpl.java:25)
    at java.lang.reflect.Method.invoke(Method.java:597)
    at org.apache.tools.ant.dispatch.DispatchUtils.execute(DispatchUtils.java:106)
    at org.apache.tools.ant.Task.perform(Task.java:348)
    at org.apache.tools.ant.Target.execute(Target.java:392)
    at org.apache.tools.ant.Target.performTasks(Target.java:413)
    at org.apache.tools.ant.Project.executeSortedTargets(Project.java:1399)
    at org.apache.tools.ant.helper.SingleCheckExecutor.executeTargets(SingleCheckExecutor.java:38)
    at org.apache.tools.ant.Project.executeTargets(Project.java:1251)
    at org.apache.tools.ant.taskdefs.Ant.execute(Ant.java:442)
    at org.apache.tools.ant.taskdefs.CallTarget.execute(CallTarget.java:105)
    at com.sencha.ant.CallTask.execute(CallTask.java:108)
    at org.apache.tools.ant.UnknownElement.execute(UnknownElement.java:291)
    at sun.reflect.GeneratedMethodAccessor21.invoke(Unknown Source)
    at sun.reflect.DelegatingMethodAccessorImpl.invoke(DelegatingMethodAccessorImpl.java:25)
    at java.lang.reflect.Method.invoke(Method.java:597)
    at org.apache.tools.ant.dispatch.DispatchUtils.execute(DispatchUtils.java:106)
    at org.apache.tools.ant.Task.perform(Task.java:348)
    at org.apache.tools.ant.Target.execute(Target.java:392)
    at org.apache.tools.ant.Target.performTasks(Target.java:413)
    at org.apache.tools.ant.Project.executeSortedTargets(Project.java:1399)
    at org.apache.tools.ant.helper.SingleCheckExecutor.executeTargets(SingleCheckExecutor.java:38)
    at org.apache.tools.ant.Project.executeTargets(Project.java:1251)
    at org.apache.tools.ant.taskdefs.Ant.execute(Ant.java:442)
    at org.apache.tools.ant.taskdefs.CallTarget.execute(CallTarget.java:105)
    at com.sencha.ant.CallTask.execute(CallTask.java:108)
    at org.apache.tools.ant.UnknownElement.execute(UnknownElement.java:291)
    at sun.reflect.GeneratedMethodAccessor21.invoke(Unknown Source)
    at sun.reflect.DelegatingMethodAccessorImpl.invoke(DelegatingMethodAccessorImpl.java:25)
    at java.lang.reflect.Method.invoke(Method.java:597)
    at org.apache.tools.ant.dispatch.DispatchUtils.execute(DispatchUtils.java:106)
    at org.apache.tools.ant.Task.perform(Task.java:348)
    at org.apache.tools.ant.Target.execute(Target.java:392)
    at org.apache.tools.ant.Target.performTasks(Target.java:413)
    at org.apache.tools.ant.Project.executeSortedTargets(Project.java:1399)
    at org.apache.tools.ant.helper.SingleCheckExecutor.executeTargets(SingleCheckExecutor.java:38)
    at org.apache.tools.ant.Project.executeTargets(Project.java:1251)
    at org.apache.tools.ant.taskdefs.Ant.execute(Ant.java:442)
    at org.apache.tools.ant.UnknownElement.execute(UnknownElement.java:291)
    at sun.reflect.NativeMethodAccessorImpl.invoke0(Native Method)
    at sun.reflect.NativeMethodAccessorImpl.invoke(NativeMethodAccessorImpl.java:39)
    at sun.reflect.DelegatingMethodAccessorImpl.invoke(DelegatingMethodAccessorImpl.java:25)
    at java.lang.reflect.Method.invoke(Method.java:597)
    at org.apache.tools.ant.dispatch.DispatchUtils.execute(DispatchUtils.java:106)
    at org.apache.tools.ant.Task.perform(Task.java:348)
    at org.apache.tools.ant.Target.execute(Target.java:392)
    at org.apache.tools.ant.Target.performTasks(Target.java:413)
    at org.apache.tools.ant.Project.executeSortedTargets(Project.java:1399)
    at org.apache.tools.ant.Project.executeTarget(Project.java:1368)
    at org.apache.tools.ant.helper.DefaultExecutor.executeTargets(DefaultExecutor.java:41)
    at org.apache.tools.ant.Project.executeTargets(Project.java:1251)
    at com.sencha.ant.AntScript.execute(AntScript.java:127)
    at com.sencha.command.plugin.PluginManager.execute(PluginManager.java:93)
    at com.sencha.command.plugin.PluginManager.executeReverseFirst(PluginManager.java:134)
    at com.sencha.command.environment.BuildEnvironment.execute(BuildEnvironment.java:245)
    at com.sencha.command.environment.AppOrPackageEnvironment.execute(AppOrPackageEnvironment.java:394)
    at com.sencha.command.BasePluginCommands$BasePluginCommand.doExecute(BasePluginCommands.java:23)
    at com.sencha.command.app.AppCommands$BuildCommand.execute(AppCommands.java:130)
    at sun.reflect.NativeMethodAccessorImpl.invoke0(Native Method)
    at sun.reflect.NativeMethodAccessorImpl.invoke(NativeMethodAccessorImpl.java:39)
    at sun.reflect.DelegatingMethodAccessorImpl.invoke(DelegatingMethodAccessorImpl.java:25)
    at java.lang.reflect.Method.invoke(Method.java:597)
    at com.sencha.util.MethodInvoker$Arguments.invoke(MethodInvoker.java:174)
    at com.sencha.cli.Command.dispatch(Command.java:42)
    at com.sencha.cli.Commands.dispatch(Commands.java:62)
    at com.sencha.cli.Commands.dispatch(Commands.java:62)
    at com.sencha.command.Sencha.dispatch(Sencha.java:79)
    at com.sencha.command.Sencha.main(Sencha.java:147)
    Caused by: The following error occurred while executing this line:
    /Users/alexesc/Sites/touch2.3/.sencha/app/packager-impl.xml:60: com.google.gson.JsonSyntaxException: com.google.gson.stream.MalformedJsonException: Expected ':' at line 2 column 10
    at org.apache.tools.ant.ProjectHelper.addLocationToBuildException(ProjectHelper.java:551)
    at org.apache.tools.ant.taskdefs.MacroInstance.execute(MacroInstance.java:401)
    at org.apache.tools.ant.UnknownElement.execute(UnknownElement.java:291)
    at sun.reflect.GeneratedMethodAccessor21.invoke(Unknown Source)
    at sun.reflect.DelegatingMethodAccessorImpl.invoke(DelegatingMethodAccessorImpl.java:25)
    at java.lang.reflect.Method.invoke(Method.java:597)
    at org.apache.tools.ant.dispatch.DispatchUtils.execute(DispatchUtils.java:106)
    at org.apache.tools.ant.Task.perform(Task.java:348)
    at org.apache.tools.ant.taskdefs.Sequential.execute(Sequential.java:68)
    at org.apache.tools.ant.UnknownElement.execute(UnknownElement.java:291)
    at sun.reflect.GeneratedMethodAccessor21.invoke(Unknown Source)
    at sun.reflect.DelegatingMethodAccessorImpl.invoke(DelegatingMethodAccessorImpl.java:25)
    at java.lang.reflect.Method.invoke(Method.java:597)
    at org.apache.tools.ant.dispatch.DispatchUtils.execute(DispatchUtils.java:106)
    at org.apache.tools.ant.Task.perform(Task.java:348)
    at org.apache.tools.ant.taskdefs.MacroInstance.execute(MacroInstance.java:398)
    at net.sf.antcontrib.logic.ForTask.doSequentialIteration(ForTask.java:259)
    at net.sf.antcontrib.logic.ForTask.doToken(ForTask.java:268)
    at net.sf.antcontrib.logic.ForTask.doTheTasks(ForTask.java:299)
    at net.sf.antcontrib.logic.ForTask.execute(ForTask.java:244)
    at org.apache.tools.ant.UnknownElement.execute(UnknownElement.java:291)
    at sun.reflect.GeneratedMethodAccessor21.invoke(Unknown Source)
    at sun.reflect.DelegatingMethodAccessorImpl.invoke(DelegatingMethodAccessorImpl.java:25)
    at java.lang.reflect.Method.invoke(Method.java:597)
    at org.apache.tools.ant.dispatch.DispatchUtils.execute(DispatchUtils.java:106)
    at org.apache.tools.ant.Task.perform(Task.java:348)
    at org.apache.tools.ant.taskdefs.Sequential.execute(Sequential.java:68)
    at net.sf.antcontrib.logic.IfTask.execute(IfTask.java:217)
    at sun.reflect.GeneratedMethodAccessor50.invoke(Unknown Source)
    at sun.reflect.DelegatingMethodAccessorImpl.invoke(DelegatingMethodAccessorImpl.java:25)
    at java.lang.reflect.Method.invoke(Method.java:597)
    at org.apache.tools.ant.dispatch.DispatchUtils.execute(DispatchUtils.java:106)
    at org.apache.tools.ant.TaskAdapter.execute(TaskAdapter.java:154)
    at org.apache.tools.ant.UnknownElement.execute(UnknownElement.java:291)
    at sun.reflect.GeneratedMethodAccessor21.invoke(Unknown Source)
    at sun.reflect.DelegatingMethodAccessorImpl.invoke(DelegatingMethodAccessorImpl.java:25)
    at java.lang.reflect.Method.invoke(Method.java:597)
    at org.apache.tools.ant.dispatch.DispatchUtils.execute(DispatchUtils.java:106)
    at org.apache.tools.ant.Task.perform(Task.java:348)
    at org.apache.tools.ant.Target.execute(Target.java:392)
    at org.apache.tools.ant.Target.performTasks(Target.java:413)
    at org.apache.tools.ant.Project.executeSortedTargets(Project.java:1399)
    at org.apache.tools.ant.helper.SingleCheckExecutor.executeTargets(SingleCheckExecutor.java:38)
    at org.apache.tools.ant.Project.executeTargets(Project.java:1251)
    at org.apache.tools.ant.taskdefs.Ant.execute(Ant.java:442)
    at org.apache.tools.ant.taskdefs.CallTarget.execute(CallTarget.java:105)
    at com.sencha.ant.CallTask.execute(CallTask.java:108)
    at org.apache.tools.ant.UnknownElement.execute(UnknownElement.java:291)
    at sun.reflect.GeneratedMethodAccessor21.invoke(Unknown Source)
    at sun.reflect.DelegatingMethodAccessorImpl.invoke(DelegatingMethodAccessorImpl.java:25)
    at java.lang.reflect.Method.invoke(Method.java:597)
    at org.apache.tools.ant.dispatch.DispatchUtils.execute(DispatchUtils.java:106)
    at org.apache.tools.ant.Task.perform(Task.java:348)
    at org.apache.tools.ant.Target.execute(Target.java:392)
    at org.apache.tools.ant.Target.performTasks(Target.java:413)
    at org.apache.tools.ant.Project.executeSortedTargets(Project.java:1399)
    at org.apache.tools.ant.helper.SingleCheckExecutor.executeTargets(SingleCheckExecutor.java:38)
    at org.apache.tools.ant.Project.executeTargets(Project.java:1251)
    at org.apache.tools.ant.taskdefs.Ant.execute(Ant.java:442)
    at org.apache.tools.ant.taskdefs.CallTarget.execute(CallTarget.java:105)
    at com.sencha.ant.CallTask.execute(CallTask.java:108)
    at org.apache.tools.ant.UnknownElement.execute(UnknownElement.java:291)
    at sun.reflect.GeneratedMethodAccessor21.invoke(Unknown Source)
    at sun.reflect.DelegatingMethodAccessorImpl.invoke(DelegatingMethodAccessorImpl.java:25)
    at java.lang.reflect.Method.invoke(Method.java:597)
    at org.apache.tools.ant.dispatch.DispatchUtils.execute(DispatchUtils.java:106)
    at org.apache.tools.ant.Task.perform(Task.java:348)
    at org.apache.tools.ant.Target.execute(Target.java:392)
    at org.apache.tools.ant.Target.performTasks(Target.java:413)
    at org.apache.tools.ant.Project.executeSortedTargets(Project.java:1399)
    at org.apache.tools.ant.helper.SingleCheckExecutor.executeTargets(SingleCheckExecutor.java:38)
    at org.apache.tools.ant.Project.executeTargets(Project.java:1251)
    at org.apache.tools.ant.taskdefs.Ant.execute(Ant.java:442)
    at org.apache.tools.ant.UnknownElement.execute(UnknownElement.java:291)
    at sun.reflect.NativeMethodAccessorImpl.invoke0(Native Method)
    at sun.reflect.NativeMethodAccessorImpl.invoke(NativeMethodAccessorImpl.java:39)
    at sun.reflect.DelegatingMethodAccessorImpl.invoke(DelegatingMethodAccessorImpl.java:25)
    at java.lang.reflect.Method.invoke(Method.java:597)
    at org.apache.tools.ant.dispatch.DispatchUtils.execute(DispatchUtils.java:106)
    at org.apache.tools.ant.Task.perform(Task.java:348)
    at org.apache.tools.ant.Target.execute(Target.java:392)
    at org.apache.tools.ant.Target.performTasks(Target.java:413)
    at org.apache.tools.ant.Project.executeSortedTargets(Project.java:1399)
    at org.apache.tools.ant.Project.executeTarget(Project.java:1368)
    at org.apache.tools.ant.helper.DefaultExecutor.executeTargets(DefaultExecutor.java:41)
    at org.apache.tools.ant.Project.executeTargets(Project.java:1251)
    at com.sencha.ant.AntScript.execute(AntScript.java:127)
    at com.sencha.command.plugin.PluginManager.execute(PluginManager.java:93)
    at com.sencha.command.plugin.PluginManager.executeReverseFirst(PluginManager.java:134)
    at com.sencha.command.environment.BuildEnvironment.execute(BuildEnvironment.java:245)
    at com.sencha.command.environment.AppOrPackageEnvironment.execute(AppOrPackageEnvironment.java:394)
    at com.sencha.command.BasePluginCommands$BasePluginCommand.doExecute(BasePluginCommands.java:23)
    at com.sencha.command.app.AppCommands$BuildCommand.execute(AppCommands.java:130)
    at sun.reflect.NativeMethodAccessorImpl.invoke0(Native Method)
    at sun.reflect.NativeMethodAccessorImpl.invoke(NativeMethodAccessorImpl.java:39)
    at sun.reflect.DelegatingMethodAccessorImpl.invoke(DelegatingMethodAccessorImpl.java:25)
    at java.lang.reflect.Method.invoke(Method.java:597)
    at com.sencha.util.MethodInvoker$Arguments.invoke(MethodInvoker.java:174)
    at com.sencha.cli.Command.dispatch(Command.java:42)
    at com.sencha.cli.Commands.dispatch(Commands.java:62)
    at com.sencha.cli.Commands.dispatch(Commands.java:62)
    at com.sencha.command.Sencha.dispatch(Sencha.java:79)
    at com.sencha.command.Sencha.main(Sencha.java:147)
    Caused by: com.google.gson.JsonSyntaxException: com.google.gson.stream.MalformedJsonException: Expected ':' at line 2 column 10
    at org.apache.tools.ant.dispatch.DispatchUtils.execute(DispatchUtils.java:116)
    at org.apache.tools.ant.Task.perform(Task.java:348)
    at org.apache.tools.ant.taskdefs.Sequential.execute(Sequential.java:68)
    at org.apache.tools.ant.UnknownElement.execute(UnknownElement.java:291)
    at sun.reflect.GeneratedMethodAccessor21.invoke(Unknown Source)
    at sun.reflect.DelegatingMethodAccessorImpl.invoke(DelegatingMethodAccessorImpl.java:25)
    at java.lang.reflect.Method.invoke(Method.java:597)
    at org.apache.tools.ant.dispatch.DispatchUtils.execute(DispatchUtils.java:106)
    at org.apache.tools.ant.Task.perform(Task.java:348)
    at org.apache.tools.ant.taskdefs.MacroInstance.execute(MacroInstance.java:398)
    at org.apache.tools.ant.UnknownElement.execute(UnknownElement.java:291)
    at sun.reflect.GeneratedMethodAccessor21.invoke(Unknown Source)
    at sun.reflect.DelegatingMethodAccessorImpl.invoke(DelegatingMethodAccessorImpl.java:25)
    at java.lang.reflect.Method.invoke(Method.java:597)
    at org.apache.tools.ant.dispatch.DispatchUtils.execute(DispatchUtils.java:106)
    at org.apache.tools.ant.Task.perform(Task.java:348)
    at org.apache.tools.ant.taskdefs.Sequential.execute(Sequential.java:68)
    at org.apache.tools.ant.UnknownElement.execute(UnknownElement.java:291)
    at sun.reflect.GeneratedMethodAccessor21.invoke(Unknown Source)
    at sun.reflect.DelegatingMethodAccessorImpl.invoke(DelegatingMethodAccessorImpl.java:25)
    at java.lang.reflect.Method.invoke(Method.java:597)
    at org.apache.tools.ant.dispatch.DispatchUtils.execute(DispatchUtils.java:106)
    at org.apache.tools.ant.Task.perform(Task.java:348)
    at org.apache.tools.ant.taskdefs.MacroInstance.execute(MacroInstance.java:398)
    at net.sf.antcontrib.logic.ForTask.doSequentialIteration(ForTask.java:259)
    at net.sf.antcontrib.logic.ForTask.doToken(ForTask.java:268)
    at net.sf.antcontrib.logic.ForTask.doTheTasks(ForTask.java:299)
    at net.sf.antcontrib.logic.ForTask.execute(ForTask.java:244)
    at org.apache.tools.ant.UnknownElement.execute(UnknownElement.java:291)
    at sun.reflect.GeneratedMethodAccessor21.invoke(Unknown Source)
    at sun.reflect.DelegatingMethodAccessorImpl.invoke(DelegatingMethodAccessorImpl.java:25)
    at java.lang.reflect.Method.invoke(Method.java:597)
    at org.apache.tools.ant.dispatch.DispatchUtils.execute(DispatchUtils.java:106)
    at org.apache.tools.ant.Task.perform(Task.java:348)
    at org.apache.tools.ant.taskdefs.Sequential.execute(Sequential.java:68)
    at net.sf.antcontrib.logic.IfTask.execute(IfTask.java:217)
    at sun.reflect.GeneratedMethodAccessor50.invoke(Unknown Source)
    at sun.reflect.DelegatingMethodAccessorImpl.invoke(DelegatingMethodAccessorImpl.java:25)
    at java.lang.reflect.Method.invoke(Method.java:597)
    at org.apache.tools.ant.dispatch.DispatchUtils.execute(DispatchUtils.java:106)
    at org.apache.tools.ant.TaskAdapter.execute(TaskAdapter.java:154)
    at org.apache.tools.ant.UnknownElement.execute(UnknownElement.java:291)
    at sun.reflect.GeneratedMethodAccessor21.invoke(Unknown Source)
    at sun.reflect.DelegatingMethodAccessorImpl.invoke(DelegatingMethodAccessorImpl.java:25)
    at java.lang.reflect.Method.invoke(Method.java:597)
    at org.apache.tools.ant.dispatch.DispatchUtils.execute(DispatchUtils.java:106)
    at org.apache.tools.ant.Task.perform(Task.java:348)
    at org.apache.tools.ant.Target.execute(Target.java:392)
    at org.apache.tools.ant.Target.performTasks(Target.java:413)
    at org.apache.tools.ant.Project.executeSortedTargets(Project.java:1399)
    at org.apache.tools.ant.helper.SingleCheckExecutor.executeTargets(SingleCheckExecutor.java:38)
    at org.apache.tools.ant.Project.executeTargets(Project.java:1251)
    at org.apache.tools.ant.taskdefs.Ant.execute(Ant.java:442)
    at org.apache.tools.ant.taskdefs.CallTarget.execute(CallTarget.java:105)
    at com.sencha.ant.CallTask.execute(CallTask.java:108)
    at org.apache.tools.ant.UnknownElement.execute(UnknownElement.java:291)
    at sun.reflect.GeneratedMethodAccessor21.invoke(Unknown Source)
    at sun.reflect.DelegatingMethodAccessorImpl.invoke(DelegatingMethodAccessorImpl.java:25)
    at java.lang.reflect.Method.invoke(Method.java:597)
    at org.apache.tools.ant.dispatch.DispatchUtils.execute(DispatchUtils.java:106)
    at org.apache.tools.ant.Task.perform(Task.java:348)
    at org.apache.tools.ant.Target.execute(Target.java:392)
    at org.apache.tools.ant.Target.performTasks(Target.java:413)
    at org.apache.tools.ant.Project.executeSortedTargets(Project.java:1399)
    at org.apache.tools.ant.helper.SingleCheckExecutor.executeTargets(SingleCheckExecutor.java:38)
    at org.apache.tools.ant.Project.executeTargets(Project.java:1251)
    at org.apache.tools.ant.taskdefs.Ant.execute(Ant.java:442)
    at org.apache.tools.ant.taskdefs.CallTarget.execute(CallTarget.java:105)
    at com.sencha.ant.CallTask.execute(CallTask.java:108)
    at org.apache.tools.ant.UnknownElement.execute(UnknownElement.java:291)
    at sun.reflect.GeneratedMethodAccessor21.invoke(Unknown Source)
    at sun.reflect.DelegatingMethodAccessorImpl.invoke(DelegatingMethodAccessorImpl.java:25)
    at java.lang.reflect.Method.invoke(Method.java:597)
    at org.apache.tools.ant.dispatch.DispatchUtils.execute(DispatchUtils.java:106)
    at org.apache.tools.ant.Task.perform(Task.java:348)
    at org.apache.tools.ant.Target.execute(Target.java:392)
    at org.apache.tools.ant.Target.performTasks(Target.java:413)
    at org.apache.tools.ant.Project.executeSortedTargets(Project.java:1399)
    at org.apache.tools.ant.helper.SingleCheckExecutor.executeTargets(SingleCheckExecutor.java:38)
    at org.apache.tools.ant.Project.executeTargets(Project.java:1251)
    at org.apache.tools.ant.taskdefs.Ant.execute(Ant.java:442)
    at org.apache.tools.ant.UnknownElement.execute(UnknownElement.java:291)
    at sun.reflect.NativeMethodAccessorImpl.invoke0(Native Method)
    at sun.reflect.NativeMethodAccessorImpl.invoke(NativeMethodAccessorImpl.java:39)
    at sun.reflect.DelegatingMethodAccessorImpl.invoke(DelegatingMethodAccessorImpl.java:25)
    at java.lang.reflect.Method.invoke(Method.java:597)
    at org.apache.tools.ant.dispatch.DispatchUtils.execute(DispatchUtils.java:106)
    at org.apache.tools.ant.Task.perform(Task.java:348)
    at org.apache.tools.ant.Target.execute(Target.java:392)
    at org.apache.tools.ant.Target.performTasks(Target.java:413)
    at org.apache.tools.ant.Project.executeSortedTargets(Project.java:1399)
    at org.apache.tools.ant.Project.executeTarget(Project.java:1368)
    at org.apache.tools.ant.helper.DefaultExecutor.executeTargets(DefaultExecutor.java:41)
    at org.apache.tools.ant.Project.executeTargets(Project.java:1251)
    at com.sencha.ant.AntScript.execute(AntScript.java:127)
    at com.sencha.command.plugin.PluginManager.execute(PluginManager.java:93)
    at com.sencha.command.plugin.PluginManager.executeReverseFirst(PluginManager.java:134)
    at com.sencha.command.environment.BuildEnvironment.execute(BuildEnvironment.java:245)
    at com.sencha.command.environment.AppOrPackageEnvironment.execute(AppOrPackageEnvironment.java:394)
    at com.sencha.command.BasePluginCommands$BasePluginCommand.doExecute(BasePluginCommands.java:23)
    at com.sencha.command.app.AppCommands$BuildCommand.execute(AppCommands.java:130)
    at sun.reflect.NativeMethodAccessorImpl.invoke0(Native Method)
    at sun.reflect.NativeMethodAccessorImpl.invoke(NativeMethodAccessorImpl.java:39)
    at sun.reflect.DelegatingMethodAccessorImpl.invoke(DelegatingMethodAccessorImpl.java:25)
    at java.lang.reflect.Method.invoke(Method.java:597)
    at com.sencha.util.MethodInvoker$Arguments.invoke(MethodInvoker.java:174)
    at com.sencha.cli.Command.dispatch(Command.java:42)
    at com.sencha.cli.Commands.dispatch(Commands.java:62)
    at com.sencha.cli.Commands.dispatch(Commands.java:62)
    at com.sencha.command.Sencha.dispatch(Sencha.java:79)
    at com.sencha.command.Sencha.main(Sencha.java:147)
    Caused by: com.google.gson.stream.MalformedJsonException: Expected ':' at line 2 column 10
    at com.google.gson.Gson.fromJson(Gson.java:805)
    at com.google.gson.Gson.fromJson(Gson.java:757)
    at com.google.gson.Gson.fromJson(Gson.java:706)
    at com.sencha.util.JsonUtil$ThreadSafeGson.fromJson(JsonUtil.java:228)
    at com.sencha.util.JsonUtil.fromJson(JsonUtil.java:119)
    at com.sencha.ant.JsonPropertySetterTask.doExecute(JsonPropertySetterTask.java:42)
    at com.sencha.ant.BaseAntTask.execute(BaseAntTask.java:32)
    at org.apache.tools.ant.UnknownElement.execute(UnknownElement.java:291)
    at sun.reflect.GeneratedMethodAccessor21.invoke(Unknown Source)
    at sun.reflect.DelegatingMethodAccessorImpl.invoke(DelegatingMethodAccessorImpl.java:25)
    at java.lang.reflect.Method.invoke(Method.java:597)
    at org.apache.tools.ant.dispatch.DispatchUtils.execute(DispatchUtils.java:106)
    at org.apache.tools.ant.Task.perform(Task.java:348)
    at org.apache.tools.ant.taskdefs.Sequential.execute(Sequential.java:68)
    at org.apache.tools.ant.UnknownElement.execute(UnknownElement.java:291)
    at sun.reflect.GeneratedMethodAccessor21.invoke(Unknown Source)
    at sun.reflect.DelegatingMethodAccessorImpl.invoke(DelegatingMethodAccessorImpl.java:25)
    at java.lang.reflect.Method.invoke(Method.java:597)
    at org.apache.tools.ant.dispatch.DispatchUtils.execute(DispatchUtils.java:106)
    at org.apache.tools.ant.Task.perform(Task.java:348)
    at org.apache.tools.ant.taskdefs.MacroInstance.execute(MacroInstance.java:398)
    at org.apache.tools.ant.UnknownElement.execute(UnknownElement.java:291)
    at sun.reflect.GeneratedMethodAccessor21.invoke(Unknown Source)
    at sun.reflect.DelegatingMethodAccessorImpl.invoke(DelegatingMethodAccessorImpl.java:25)
    at java.lang.reflect.Method.invoke(Method.java:597)
    at org.apache.tools.ant.dispatch.DispatchUtils.execute(DispatchUtils.java:106)
    at org.apache.tools.ant.Task.perform(Task.java:348)
    at org.apache.tools.ant.taskdefs.Sequential.execute(Sequential.java:68)
    at org.apache.tools.ant.UnknownElement.execute(UnknownElement.java:291)
    at sun.reflect.GeneratedMethodAccessor21.invoke(Unknown Source)
    at sun.reflect.DelegatingMethodAccessorImpl.invoke(DelegatingMethodAccessorImpl.java:25)
    at java.lang.reflect.Method.invoke(Method.java:597)
    at org.apache.tools.ant.dispatch.DispatchUtils.execute(DispatchUtils.java:106)
    at org.apache.tools.ant.Task.perform(Task.java:348)
    at org.apache.tools.ant.taskdefs.MacroInstance.execute(MacroInstance.java:398)
    at net.sf.antcontrib.logic.ForTask.doSequentialIteration(ForTask.java:259)
    at net.sf.antcontrib.logic.ForTask.doToken(ForTask.java:268)
    at net.sf.antcontrib.logic.ForTask.doTheTasks(ForTask.java:299)
    at net.sf.antcontrib.logic.ForTask.execute(ForTask.java:244)
    at org.apache.tools.ant.UnknownElement.execute(UnknownElement.java:291)
    at sun.reflect.GeneratedMethodAccessor21.invoke(Unknown Source)
    at sun.reflect.DelegatingMethodAccessorImpl.invoke(DelegatingMethodAccessorImpl.java:25)
    at java.lang.reflect.Method.invoke(Method.java:597)
    at org.apache.tools.ant.dispatch.DispatchUtils.execute(DispatchUtils.java:106)
    at org.apache.tools.ant.Task.perform(Task.java:348)
    at org.apache.tools.ant.taskdefs.Sequential.execute(Sequential.java:68)
    at net.sf.antcontrib.logic.IfTask.execute(IfTask.java:217)
    at sun.reflect.GeneratedMethodAccessor50.invoke(Unknown Source)
    at sun.reflect.DelegatingMethodAccessorImpl.invoke(DelegatingMethodAccessorImpl.java:25)
    at java.lang.reflect.Method.invoke(Method.java:597)
    at org.apache.tools.ant.dispatch.DispatchUtils.execute(DispatchUtils.java:106)
    at org.apache.tools.ant.TaskAdapter.execute(TaskAdapter.java:154)
    at org.apache.tools.ant.UnknownElement.execute(UnknownElement.java:291)
    at sun.reflect.GeneratedMethodAccessor21.invoke(Unknown Source)
    at sun.reflect.DelegatingMethodAccessorImpl.invoke(DelegatingMethodAccessorImpl.java:25)
    at java.lang.reflect.Method.invoke(Method.java:597)
    at org.apache.tools.ant.dispatch.DispatchUtils.execute(DispatchUtils.java:106)
    at org.apache.tools.ant.Task.perform(Task.java:348)
    at org.apache.tools.ant.Target.execute(Target.java:392)
    at org.apache.tools.ant.Target.performTasks(Target.java:413)
    at org.apache.tools.ant.Project.executeSortedTargets(Project.java:1399)
    at org.apache.tools.ant.helper.SingleCheckExecutor.executeTargets(SingleCheckExecutor.java:38)
    at org.apache.tools.ant.Project.executeTargets(Project.java:1251)
    at org.apache.tools.ant.taskdefs.Ant.execute(Ant.java:442)
    at org.apache.tools.ant.taskdefs.CallTarget.execute(CallTarget.java:105)
    at com.sencha.ant.CallTask.execute(CallTask.java:108)
    at org.apache.tools.ant.UnknownElement.execute(UnknownElement.java:291)
    at sun.reflect.GeneratedMethodAccessor21.invoke(Unknown Source)
    at sun.reflect.DelegatingMethodAccessorImpl.invoke(DelegatingMethodAccessorImpl.java:25)
    at java.lang.reflect.Method.invoke(Method.java:597)
    at org.apache.tools.ant.dispatch.DispatchUtils.execute(DispatchUtils.java:106)
    at org.apache.tools.ant.Task.perform(Task.java:348)
    at org.apache.tools.ant.Target.execute(Target.java:392)
    at org.apache.tools.ant.Target.performTasks(Target.java:413)
    at org.apache.tools.ant.Project.executeSortedTargets(Project.java:1399)
    at org.apache.tools.ant.helper.SingleCheckExecutor.executeTargets(SingleCheckExecutor.java:38)
    at org.apache.tools.ant.Project.executeTargets(Project.java:1251)
    at org.apache.tools.ant.taskdefs.Ant.execute(Ant.java:442)
    at org.apache.tools.ant.taskdefs.CallTarget.execute(CallTarget.java:105)
    at com.sencha.ant.CallTask.execute(CallTask.java:108)
    at org.apache.tools.ant.UnknownElement.execute(UnknownElement.java:291)
    at sun.reflect.GeneratedMethodAccessor21.invoke(Unknown Source)
    at sun.reflect.DelegatingMethodAccessorImpl.invoke(DelegatingMethodAccessorImpl.java:25)
    at java.lang.reflect.Method.invoke(Method.java:597)
    at org.apache.tools.ant.dispatch.DispatchUtils.execute(DispatchUtils.java:106)
    at org.apache.tools.ant.Task.perform(Task.java:348)
    at org.apache.tools.ant.Target.execute(Target.java:392)
    at org.apache.tools.ant.Target.performTasks(Target.java:413)
    at org.apache.tools.ant.Project.executeSortedTargets(Project.java:1399)
    at org.apache.tools.ant.helper.SingleCheckExecutor.executeTargets(SingleCheckExecutor.java:38)
    at org.apache.tools.ant.Project.executeTargets(Project.java:1251)
    at org.apache.tools.ant.taskdefs.Ant.execute(Ant.java:442)
    at org.apache.tools.ant.UnknownElement.execute(UnknownElement.java:291)
    at sun.reflect.NativeMethodAccessorImpl.invoke0(Native Method)
    at sun.reflect.NativeMethodAccessorImpl.invoke(NativeMethodAccessorImpl.java:39)
    at sun.reflect.DelegatingMethodAccessorImpl.invoke(DelegatingMethodAccessorImpl.java:25)
    at java.lang.reflect.Method.invoke(Method.java:597)
    at org.apache.tools.ant.dispatch.DispatchUtils.execute(DispatchUtils.java:106)
    at org.apache.tools.ant.Task.perform(Task.java:348)
    at org.apache.tools.ant.Target.execute(Target.java:392)
    at org.apache.tools.ant.Target.performTasks(Target.java:413)
    at org.apache.tools.ant.Project.executeSortedTargets(Project.java:1399)
    at org.apache.tools.ant.Project.executeTarget(Project.java:1368)
    at org.apache.tools.ant.helper.DefaultExecutor.executeTargets(DefaultExecutor.java:41)
    at org.apache.tools.ant.Project.executeTargets(Project.java:1251)
    at com.sencha.ant.AntScript.execute(AntScript.java:127)
    at com.sencha.command.plugin.PluginManager.execute(PluginManager.java:93)
    at com.sencha.command.plugin.PluginManager.executeReverseFirst(PluginManager.java:134)
    at com.sencha.command.environment.BuildEnvironment.execute(BuildEnvironment.java:245)
    at com.sencha.command.environment.AppOrPackageEnvironment.execute(AppOrPackageEnvironment.java:394)
    at com.sencha.command.BasePluginCommands$BasePluginCommand.doExecute(BasePluginCommands.java:23)
    at com.sencha.command.app.AppCommands$BuildCommand.execute(AppCommands.java:130)
    at sun.reflect.NativeMethodAccessorImpl.invoke0(Native Method)
    at sun.reflect.NativeMethodAccessorImpl.invoke(NativeMethodAccessorImpl.java:39)
    at sun.reflect.DelegatingMethodAccessorImpl.invoke(DelegatingMethodAccessorImpl.java:25)
    at java.lang.reflect.Method.invoke(Method.java:597)
    at com.sencha.util.MethodInvoker$Arguments.invoke(MethodInvoker.java:174)
    at com.sencha.cli.Command.dispatch(Command.java:42)
    at com.sencha.cli.Commands.dispatch(Commands.java:62)
    at com.sencha.cli.Commands.dispatch(Commands.java:62)
    at com.sencha.command.Sencha.dispatch(Sencha.java:79)
    at com.sencha.command.Sencha.main(Sencha.java:147)
    Caused by: Expected ':' at line 2 column 10
    at com.google.gson.stream.JsonReader.syntaxError(JsonReader.java:1310)
    at com.google.gson.stream.JsonReader.objectValue(JsonReader.java:762)
    at com.google.gson.stream.JsonReader.peek(JsonReader.java:380)
    at com.google.gson.internal.bind.ObjectTypeAdapter.read(ObjectTypeAdapter.java:54)
    at com.google.gson.internal.bind.TypeAdapterRuntimeTypeWrapper.read(TypeAdapterRuntimeTypeWrapper.java:40)
    at com.google.gson.internal.bind.MapTypeAdapterFactory$Adapter.read(MapTypeAdapterFactory.java:188)
    at com.google.gson.internal.bind.MapTypeAdapterFactory$Adapter.read(MapTypeAdapterFactory.java:146)
    at com.google.gson.Gson.fromJson(Gson.java:791)
    at com.google.gson.Gson.fromJson(Gson.java:757)
    at com.google.gson.Gson.fromJson(Gson.java:706)
    at com.sencha.util.JsonUtil$ThreadSafeGson.fromJson(JsonUtil.java:228)
    at com.sencha.util.JsonUtil.fromJson(JsonUtil.java:119)
    at com.sencha.ant.JsonPropertySetterTask.doExecute(JsonPropertySetterTask.java:42)
    at com.sencha.ant.BaseAntTask.execute(BaseAntTask.java:32)
    at org.apache.tools.ant.UnknownElement.execute(UnknownElement.java:291)
    at sun.reflect.GeneratedMethodAccessor21.invoke(Unknown Source)
    at sun.reflect.DelegatingMethodAccessorImpl.invoke(DelegatingMethodAccessorImpl.java:25)
    at java.lang.reflect.Method.invoke(Method.java:597)
    at org.apache.tools.ant.dispatch.DispatchUtils.execute(DispatchUtils.java:106)
    at org.apache.tools.ant.Task.perform(Task.java:348)
    at org.apache.tools.ant.taskdefs.Sequential.execute(Sequential.java:68)
    at org.apache.tools.ant.UnknownElement.execute(UnknownElement.java:291)
    at sun.reflect.GeneratedMethodAccessor21.invoke(Unknown Source)
    at sun.reflect.DelegatingMethodAccessorImpl.invoke(DelegatingMethodAccessorImpl.java:25)
    at java.lang.reflect.Method.invoke(Method.java:597)
    at org.apache.tools.ant.dispatch.DispatchUtils.execute(DispatchUtils.java:106)
    at org.apache.tools.ant.Task.perform(Task.java:348)
    at org.apache.tools.ant.taskdefs.MacroInstance.execute(MacroInstance.java:398)
    at org.apache.tools.ant.UnknownElement.execute(UnknownElement.java:291)
    at sun.reflect.GeneratedMethodAccessor21.invoke(Unknown Source)
    at sun.reflect.DelegatingMethodAccessorImpl.invoke(DelegatingMethodAccessorImpl.java:25)
    at java.lang.reflect.Method.invoke(Method.java:597)
    at org.apache.tools.ant.dispatch.DispatchUtils.execute(DispatchUtils.java:106)
    at org.apache.tools.ant.Task.perform(Task.java:348)
    at org.apache.tools.ant.taskdefs.Sequential.execute(Sequential.java:68)
    at org.apache.tools.ant.UnknownElement.execute(UnknownElement.java:291)
    at sun.reflect.GeneratedMethodAccessor21.invoke(Unknown Source)
    at sun.reflect.DelegatingMethodAccessorImpl.invoke(DelegatingMethodAccessorImpl.java:25)
    at java.lang.reflect.Method.invoke(Method.java:597)
    at org.apache.tools.ant.dispatch.DispatchUtils.execute(DispatchUtils.java:106)
    at org.apache.tools.ant.Task.perform(Task.java:348)
    at org.apache.tools.ant.taskdefs.MacroInstance.execute(MacroInstance.java:398)
    at net.sf.antcontrib.logic.ForTask.doSequentialIteration(ForTask.java:259)
    at net.sf.antcontrib.logic.ForTask.doToken(ForTask.java:268)
    at net.sf.antcontrib.logic.ForTask.doTheTasks(ForTask.java:299)
    at net.sf.antcontrib.logic.ForTask.execute(ForTask.java:244)
    at org.apache.tools.ant.UnknownElement.execute(UnknownElement.java:291)
    at sun.reflect.GeneratedMethodAccessor21.invoke(Unknown Source)
    at sun.reflect.DelegatingMethodAccessorImpl.invoke(DelegatingMethodAccessorImpl.java:25)
    at java.lang.reflect.Method.invoke(Method.java:597)
    at org.apache.tools.ant.dispatch.DispatchUtils.execute(DispatchUtils.java:106)
    at org.apache.tools.ant.Task.perform(Task.java:348)
    at org.apache.tools.ant.taskdefs.Sequential.execute(Sequential.java:68)
    at net.sf.antcontrib.logic.IfTask.execute(IfTask.java:217)
    at sun.reflect.GeneratedMethodAccessor50.invoke(Unknown Source)
    at sun.reflect.DelegatingMethodAccessorImpl.invoke(DelegatingMethodAccessorImpl.java:25)
    at java.lang.reflect.Method.invoke(Method.java:597)
    at org.apache.tools.ant.dispatch.DispatchUtils.execute(DispatchUtils.java:106)
    at org.apache.tools.ant.TaskAdapter.execute(TaskAdapter.java:154)
    at org.apache.tools.ant.UnknownElement.execute(UnknownElement.java:291)
    at sun.reflect.GeneratedMethodAccessor21.invoke(Unknown Source)
    at sun.reflect.DelegatingMethodAccessorImpl.invoke(DelegatingMethodAccessorImpl.java:25)
    at java.lang.reflect.Method.invoke(Method.java:597)
    at org.apache.tools.ant.dispatch.DispatchUtils.execute(DispatchUtils.java:106)
    at org.apache.tools.ant.Task.perform(Task.java:348)
    at org.apache.tools.ant.Target.execute(Target.java:392)
    at org.apache.tools.ant.Target.performTasks(Target.java:413)
    at org.apache.tools.ant.Project.executeSortedTargets(Project.java:1399)
    at org.apache.tools.ant.helper.SingleCheckExecutor.executeTargets(SingleCheckExecutor.java:38)
    at org.apache.tools.ant.Project.executeTargets(Project.java:1251)
    at org.apache.tools.ant.taskdefs.Ant.execute(Ant.java:442)
    at org.apache.tools.ant.taskdefs.CallTarget.execute(CallTarget.java:105)
    at com.sencha.ant.CallTask.execute(CallTask.java:108)
    at org.apache.tools.ant.UnknownElement.execute(UnknownElement.java:291)
    at sun.reflect.GeneratedMethodAccessor21.invoke(Unknown Source)
    at sun.reflect.DelegatingMethodAccessorImpl.invoke(DelegatingMethodAccessorImpl.java:25)
    at java.lang.reflect.Method.invoke(Method.java:597)
    at org.apache.tools.ant.dispatch.DispatchUtils.execute(DispatchUtils.java:106)
    at org.apache.tools.ant.Task.perform(Task.java:348)
    at org.apache.tools.ant.Target.execute(Target.java:392)
    at org.apache.tools.ant.Target.performTasks(Target.java:413)
    at org.apache.tools.ant.Project.executeSortedTargets(Project.java:1399)
    at org.apache.tools.ant.helper.SingleCheckExecutor.executeTargets(SingleCheckExecutor.java:38)
    at org.apache.tools.ant.Project.executeTargets(Project.java:1251)
    at org.apache.tools.ant.taskdefs.Ant.execute(Ant.java:442)
    at org.apache.tools.ant.taskdefs.CallTarget.execute(CallTarget.java:105)
    at com.sencha.ant.CallTask.execute(CallTask.java:108)
    at org.apache.tools.ant.UnknownElement.execute(UnknownElement.java:291)
    at sun.reflect.GeneratedMethodAccessor21.invoke(Unknown Source)
    at sun.reflect.DelegatingMethodAccessorImpl.invoke(DelegatingMethodAccessorImpl.java:25)
    at java.lang.reflect.Method.invoke(Method.java:597)
    at org.apache.tools.ant.dispatch.DispatchUtils.execute(DispatchUtils.java:106)
    at org.apache.tools.ant.Task.perform(Task.java:348)
    at org.apache.tools.ant.Target.execute(Target.java:392)
    at org.apache.tools.ant.Target.performTasks(Target.java:413)
    at org.apache.tools.ant.Project.executeSortedTargets(Project.java:1399)
    at org.apache.tools.ant.helper.SingleCheckExecutor.executeTargets(SingleCheckExecutor.java:38)
    at org.apache.tools.ant.Project.executeTargets(Project.java:1251)
    at org.apache.tools.ant.taskdefs.Ant.execute(Ant.java:442)
    at org.apache.tools.ant.UnknownElement.execute(UnknownElement.java:291)
    at sun.reflect.NativeMethodAccessorImpl.invoke0(Native Method)
    at sun.reflect.NativeMethodAccessorImpl.invoke(NativeMethodAccessorImpl.java:39)
    at sun.reflect.DelegatingMethodAccessorImpl.invoke(DelegatingMethodAccessorImpl.java:25)
    at java.lang.reflect.Method.invoke(Method.java:597)
    at org.apache.tools.ant.dispatch.DispatchUtils.execute(DispatchUtils.java:106)
    at org.apache.tools.ant.Task.perform(Task.java:348)
    at org.apache.tools.ant.Target.execute(Target.java:392)
    at org.apache.tools.ant.Target.performTasks(Target.java:413)
    at org.apache.tools.ant.Project.executeSortedTargets(Project.java:1399)
    at org.apache.tools.ant.Project.executeTarget(Project.java:1368)
    at org.apache.tools.ant.helper.DefaultExecutor.executeTargets(DefaultExecutor.java:41)
    at org.apache.tools.ant.Project.executeTargets(Project.java:1251)
    at com.sencha.ant.AntScript.execute(AntScript.java:127)
    at com.sencha.command.plugin.PluginManager.execute(PluginManager.java:93)
    at com.sencha.command.plugin.PluginManager.executeReverseFirst(PluginManager.java:134)
    at com.sencha.command.environment.BuildEnvironment.execute(BuildEnvironment.java:245)
    at com.sencha.command.environment.AppOrPackageEnvironment.execute(AppOrPackageEnvironment.java:394)
    at com.sencha.command.BasePluginCommands$BasePluginCommand.doExecute(BasePluginCommands.java:23)
    at com.sencha.command.app.AppCommands$BuildCommand.execute(AppCommands.java:130)
    at sun.reflect.NativeMethodAccessorImpl.invoke0(Native Method)
    at sun.reflect.NativeMethodAccessorImpl.invoke(NativeMethodAccessorImpl.java:39)
    at sun.reflect.DelegatingMethodAccessorImpl.invoke(DelegatingMethodAccessorImpl.java:25)
    at java.lang.reflect.Method.invoke(Method.java:597)
    at com.sencha.util.MethodInvoker$Arguments.invoke(MethodInvoker.java:174)
    at com.sencha.cli.Command.dispatch(Command.java:42)
    at com.sencha.cli.Commands.dispatch(Commands.java:62)
    at com.sencha.cli.Commands.dispatch(Commands.java:62)
    at com.sencha.command.Sencha.dispatch(Sencha.java:79)
    at com.sencha.command.Sencha.main(Sencha.java:147)

  4. #4
    Sencha User dongryphon's Avatar
    Join Date
    Jul 2009
    Location
    Kansas
    Posts
    1,748

    Default

    Looks like the packager.json may be broken:

    Code:
    com.google.gson.JsonSyntaxException: com.google.gson.stream.MalformedJsonException: Expected ''':''' at line 2 column 10
    Can you post your packager.json file?
    Don Griffin

    "Use the source, Luke!"

  5. #5
    Sencha User
    Join Date
    May 2012
    Location
    Colombia
    Posts
    46

    Default

    Oh, many many thanks. That's the reason. I upgraded de app with the cmd and do not know why the json was broken. Ok. I solved with your help that error.

  6. #6

    Default Where can i download sencha touch 2.3 beta?

    Help!! I need test. The link http://sc13-live.sencha.com/touch/touch-2.3.0-beta.zip is broken.

  7. #7
    Touch Premium Member
    Join Date
    Apr 2007
    Posts
    118

    Default

    I actually need Touch 2.3 beta 2 and the link is gone also.

  8. #8
    Sencha Premium Member akpotosufredrick's Avatar
    Join Date
    Jan 2011
    Posts
    69

    Default

    my app.json is also broken. can you please post a solution?

  9. #9
    Sencha Premium Member akpotosufredrick's Avatar
    Join Date
    Jan 2011
    Posts
    69

    Default

    Quote Originally Posted by akpotosufredrick View Post
    my app.json is also broken. can you please post a solution?
    i solved it by switching the new app.json file with the old one.
    The new one had stuff like "<<<<<<<" and "======" in it that was throwing the Errors

Posting Permissions

  • You may not post new threads
  • You may not post replies
  • You may not post attachments
  • You may not edit your posts
  •