Page 2 of 2 FirstFirst 12
Results 11 to 13 of 13

Thread: [ 5.0.1] multi theme build is broken

    You found a bug! We've classified it as SDKTOOLS-897 . We encourage you to continue the discussion and to find an acceptable workaround while we work on a permanent fix.
  1. #11
    Sencha Premium Member
    Join Date
    Jun 2014
    Posts
    4

    Default Same Issue

    Everything was working with 5.0.0 and with 5.0.1 it is not working.

  2. #12
    Sencha User IvanKaban's Avatar
    Join Date
    May 2016
    Location
    Munich
    Posts
    12

    Default

    Similar issue. This time with Sencha Cmd v6.1.2.15

    Code:
    D:\workdir\sencha\DragMoveObj>sencha app build
    Sencha Cmd v6.1.2.15
    [INF] Processing Build Descriptor : classic
    [INF] Loading app json manifest...
    [ERR]
    [ERR] BUILD FAILED
    [ERR] java.lang.IndexOutOfBoundsException: Index: 1, Size: 1
    [ERR]   at sun.reflect.NativeMethodAccessorImpl.invoke(Unknown Sou
    [ERR] rce)
    [ERR]
    [ERR] Total time: 2 seconds
    [ERR] The following error occurred while executing this line:
    D:\workdir\sencha\DragMoveObj\.sencha\app\build-impl.xml:380: The following error occurred while executing this line:
    D:\workdir\sencha\DragMoveObj\.sencha\app\init-impl.xml:382: java.lang.IndexOutOfBoundsException: Index: 1, Size: 1

  3. #13
    Sencha User
    Join Date
    Jan 2019
    Posts
    4

    Default

    Same issue in 6.5.3 - trying to add border-radius to .x-btn-default-small and getting a slicing error.

Page 2 of 2 FirstFirst 12

Posting Permissions

  • You may not post new threads
  • You may not post replies
  • You may not post attachments
  • You may not edit your posts
  •