Results 1 to 8 of 8

Thread: SA 3.5 EA Its imposible to compile a project

  1. #1
    Ext JS Premium Member
    Join Date
    Aug 2009
    Location
    Sant cugat del Valles
    Posts
    30
    Answers
    1

    Default Answered: SA 3.5 EA Its imposible to compile a project

    Hi,

    tried to create a new project and at the time to build the webapp raises an error with sass like it was hang. Result is I got the app.js and somthing like the theme css but no index file?

    Mac OS 10.9.5
    And I've created a project with version ext6.0
    At the time to build the web app the option was production
    sass version 3.4.21
    ruby ruby 2.0.0p481 (2014-05-08 revision 45883) [universal.x86_64-darwin13]
    java version "9-ea"
    Java(TM) SE Runtime Environment (build 9-ea+101-2016-01-13-175626.javare.4276.nc)
    Java HotSpot(TM) 64-Bit Server VM (build 9-ea+101-2016-01-13-175626.javare.4276.nc, mixed mode)Screen Shot 2016-02-26 at 11.38.47 AM.jpg



    Is that normal?

    Log :

    [INF] Processing Build Descriptor : default

    [INF] Starting server on port : 1841
    [INF] Mapping http://localhost:1841/~cmd to /Users/aestevez/bin/Sencha/Cmd/6.1.0.65...
    [INF] Mapping http://localhost:1841/ to /Users/aestevez/Documents/RTFD...

    [INF] Application available at http://localhost:1841

    [INF] Application available at http://localhost:1841

    [INF] Aliases are enabled

    [INF] Loading app json manifest...

    [INF] Appending content to /Users/aestevez/Documents/RTFD/bootstrap.js

    [INF] Writing content to /Users/aestevez/Documents/RTFD/bootstrap.json

    [INF] merging 223 input resources into /Users/aestevez/Documents/RTFD/build/development/rtfd/resources

    [INF] merged 0 resources into /Users/aestevez/Documents/RTFD/build/development/rtfd/resources

    [INF] merging 8 input resources into /Users/aestevez/Documents/RTFD/build/development/rtfd

    [INF] merged 1 resources into /Users/aestevez/Documents/RTFD/build/development/rtfd

    [INF] Writing content to /Users/aestevez/Documents/RTFD/sass/example/bootstrap.json

    [INF] Writing content to /Users/aestevez/Documents/RTFD/sass/example/bootstrap.js

    [INF] writing sass content to /Users/aestevez/Documents/RTFD/build/temp/development/rtfd/sass/rtfd-all.scss.tmp

    [INF] appending sass content to /Users/aestevez/Documents/RTFD/build/temp/development/rtfd/sass/rtfd-all.scss.tmp

    [INF] appending sass content to /Users/aestevez/Documents/RTFD/build/temp/development/rtfd/sass/rtfd-all.scss.tmp

    [INF] Aliases are enabled

    [INF] Building ../../build/temp/development/rtfd/sass/rtfd-all.scss

    [INF] Application available at http://localhost:1841

    [INF] Appending content to /Users/aestevez/Documents/RTFD/bootstrap.js

    [INF] Writing content to /Users/aestevez/Documents/RTFD/bootstrap.json

    [INF] Waiting for changes...

    [INF] Detected change to SASS entry: /Users/aestevez/Documents/RTFD/packages/local/theme-crisp-d6fd2884-dc10-451d-bad2-46eba59fc0cb/sass/var/Component.scss
    [INF] Detected change to SASS entry: /Users/aestevez/Documents/RTFD/packages/local/theme-crisp-d6fd2884-dc10-451d-bad2-46eba59fc0cb/sass/src/Component.scss

    [INF] Processing Build Descriptor : default

    [INF] -----------------------

    [INF] Application available at http://localhost:1841

    [INF] Application available at http://localhost:1841

    [INF] Appending content to /Users/aestevez/Documents/RTFD/bootstrap.js

    [INF] Writing content to /Users/aestevez/Documents/RTFD/bootstrap.json

    [INF] merging 223 input resources into /Users/aestevez/Documents/RTFD/build/development/rtfd/resources
    [INF] merged 0 resources into /Users/aestevez/Documents/RTFD/build/development/rtfd/resources

    [INF] Starting server on port : 1842

    [INF] Mapping http://localhost:1842/~cmd to /Users/aestevez/bin/Sencha/Cmd/6.1.0.65...
    [INF] Mapping http://localhost:1842/ to /Users/aestevez/Documents/RTFD...

    [INF] merging 8 input resources into /Users/aestevez/Documents/RTFD/build/development/rtfd
    [INF] merged 1 resources into /Users/aestevez/Documents/RTFD/build/development/rtfd

    [INF] Application available at http://localhost:1842

    [INF] Writing content to /Users/aestevez/Documents/RTFD/sass/example/bootstrap.json

    [INF] Loading app json manifest...

    [INF] Writing content to /Users/aestevez/Documents/RTFD/sass/example/bootstrap.js

    [INF] writing sass content to /Users/aestevez/Documents/RTFD/build/temp/development/rtfd/sass/rtfd-all.scss.tmp

    [INF] appending sass content to /Users/aestevez/Documents/RTFD/build/temp/development/rtfd/sass/rtfd-all.scss.tmp
    [INF] appending sass content to /Users/aestevez/Documents/RTFD/build/temp/development/rtfd/sass/rtfd-all.scss.tmp

    [INF] Using base href : /Users/aestevez/Documents/RTFD/build/development/rtfd/resources/
    [INF] Using base href : /Users/aestevez/Documents/RTFD/build/development/rtfd/resources/
    [INF] Build complete for ../../build/temp/development/rtfd/sass/rtfd-all.scss
    [INF] Building ../../build/temp/development/rtfd/sass/rtfd-all.scss

    [INF] Application available at http://localhost:1841

    [INF] Appending content to /Users/aestevez/Documents/RTFD/bootstrap.js

    [INF] Writing content to /Users/aestevez/Documents/RTFD/bootstrap.json

    [INF] Refresh complete in 6 sec. at 11:32:25 AM

    [INF] -----------------------

    [INF] Waiting for changes...

    [INF] Appending content to /Users/aestevez/Documents/RTFD/bootstrap.js

    [INF] Writing content to /Users/aestevez/Documents/RTFD/bootstrap.json

    [INF] Compressing data with YuiJavascriptCompressor

    [INF] Writing concatenated output to file /Users/aestevez/Documents/RTFD/build/production/rtfd/app.js

    [INF] merging 223 input resources into /Users/aestevez/Documents/RTFD/build/production/rtfd/resources

    [INF] merged 0 resources into /Users/aestevez/Documents/RTFD/build/production/rtfd/resources

    [INF] merging 8 input resources into /Users/aestevez/Documents/RTFD/build/production/rtfd

    [INF] merged 2 resources into /Users/aestevez/Documents/RTFD/build/production/rtfd

    [INF] Writing content to /Users/aestevez/Documents/RTFD/sass/example/bootstrap.json

    [INF] Writing content to /Users/aestevez/Documents/RTFD/sass/example/bootstrap.js

    [INF] writing sass content to /Users/aestevez/Documents/RTFD/build/temp/production/rtfd/slicer-temp/rtfd-example.scss.tmp

    [ERR] Dispatch exception No such resource: /sass/

    [ERR]

    [ERR] BUILD FAILED

    [ERR] com.sencha.exceptions.ExBuild: Timed out waiting for sass build completion
    [ERR] at org.apache.tools.ant.Task.perform(Task.j

    [ERR] ava:348)
    [ERR]
    [ERR] Total time: 1 minute 47 seconds

    [ERR] ================= Phantomjs Output =================

    [ERR] loading page http://localhost:1842/sass/example/f...phantomjs=true
    successfully loaded page http://localhost:1842/sass/example/f...phantomjs=true
    loading phantomjs adapter
    [ERR] ============= End Phantomjs Output =================

    Exception in thread "Thread-33"
    com.sencha.exceptions.BasicException: com.sencha.exceptions.BasicException: The following error occurred while executing this line:
    /Users/aestevez/Documents/RTFD/.sencha/app/build-impl.xml:335: The following error occurred while executing this line:
    /Users/aestevez/Documents/RTFD/.sencha/app/slice-impl.xml:386: The following error occurred while executing this line:
    /Users/aestevez/Documents/RTFD/.sencha/app/slice-impl.xml:387: The following error occurred while executing this line:
    /Users/aestevez/Documents/RTFD/.sencha/app/slice-impl.xml:122: com.sencha.exceptions.ExBuild: Timed out waiting for sass build completion
    at com.sencha.tools.server.service.tasks.DispatchTask.execute(DispatchTask.java:55)
    at com.sencha.tools.server.service.tasks.BaseServiceTask$1.run(BaseServiceTask.java:42)
    at com.sencha.util.ThreadUtil$1.run(ThreadUtil.java:65)
    at com.sencha.util.ThreadUtil$2.run(ThreadUtil.java:162)
    at java.lang.Thread.run(Thread.java:745)
    Caused by: com.sencha.exceptions.BasicException: The following error occurred while executing this line:
    /Users/aestevez/Documents/RTFD/.sencha/app/build-impl.xml:335: The following error occurred while executing this line:
    /Users/aestevez/Documents/RTFD/.sencha/app/slice-impl.xml:386: The following error occurred while executing this line:
    /Users/aestevez/Documents/RTFD/.sencha/app/slice-impl.xml:387: The following error occurred while executing this line:
    /Users/aestevez/Documents/RTFD/.sencha/app/slice-impl.xml:122: com.sencha.exceptions.ExBuild: Timed out waiting for sass build completion
    at com.sencha.exceptions.BasicException.wrap(BasicException.java:54)
    at com.sencha.ant.AntScript.execute(AntScript.java:120)
    at com.sencha.command.plugin.PluginManager.execute(PluginManager.java:104)
    at com.sencha.command.plugin.PluginManager.executeReverseFirst(PluginManager.java:145)
    at com.sencha.command.environment.BuildEnvironment.execute(BuildEnvironment.java:282)
    at com.sencha.command.environment.AppOrPackageEnvironment.execute(AppOrPackageEnvironment.java:759)
    at com.sencha.command.BasePluginCommands$BasePluginCommand.doExecute(BasePluginCommands.java:99)
    at com.sencha.command.app.AppCommands$BuildCommand.execute(AppCommands.java:377)
    at sun.reflect.NativeMethodAccessorImpl.invoke0(Native Method)
    at sun.reflect.NativeMethodAccessorImpl.invoke(NativeMethodAccessorImpl.java:62)
    at sun.reflect.DelegatingMethodAccessorImpl.invoke(DelegatingMethodAccessorImpl.java:43)
    at java.lang.reflect.Method.invoke(Method.java:497)
    at com.sencha.util.MethodInvoker$Arguments.invoke(MethodInvoker.java:175)
    at com.sencha.cli.Command.dispatch(Command.java:43)
    at com.sencha.command.BasePluginCommands$BasePluginCommand.dispatch(BasePluginCommands.java:260)
    at com.sencha.cli.Commands.dispatch(Commands.java:64)
    at com.sencha.cli.Commands.dispatch(Commands.java:64)
    at com.sencha.command.Sencha.dispatch(Sencha.java:79)
    at com.sencha.cli.AbstractCommand.dispatch(AbstractCommand.java:124)
    at com.sencha.tools.server.service.tasks.DispatchTask.execute(DispatchTask.java:52)
    ... 4 more
    Caused by: /Users/aestevez/bin/Sencha/Cmd/6.1.0.65/plugin.xml:327: The following error occurred while executing this line:
    /Users/aestevez/Documents/RTFD/.sencha/app/build-impl.xml:335: The following error occurred while executing this line:
    /Users/aestevez/Documents/RTFD/.sencha/app/slice-impl.xml:386: The following error occurred while executing this line:
    /Users/aestevez/Documents/RTFD/.sencha/app/slice-impl.xml:387: The following error occurred while executing this line:
    /Users/aestevez/Documents/RTFD/.sencha/app/slice-impl.xml:122: com.sencha.exceptions.ExBuild: Timed out waiting for sass build completion
    at org.apache.tools.ant.ProjectHelper.addLocationToBuildException(ProjectHelper.java:551)
    at org.apache.tools.ant.taskdefs.Ant.execute(Ant.java:444)
    at org.apache.tools.ant.UnknownElement.execute(UnknownElement.java:291)
    at sun.reflect.GeneratedMethodAccessor27.invoke(Unknown Source)
    at sun.reflect.DelegatingMethodAccessorImpl.invoke(DelegatingMethodAccessorImpl.java:43)
    at java.lang.reflect.Method.invoke(Method.java:497)
    at org.apache.tools.ant.dispatch.DispatchUtils.execute(DispatchUtils.java:106)
    at org.apache.tools.ant.Task.perform(Task.java:348)
    at org.apache.tools.ant.taskdefs.Sequential.execute(Sequential.java:68)
    at net.sf.antcontrib.logic.IfTask.execute(IfTask.java:217)
    at sun.reflect.GeneratedMethodAccessor58.invoke(Unknown Source)
    at sun.reflect.DelegatingMethodAccessorImpl.invoke(DelegatingMethodAccessorImpl.java:43)
    at java.lang.reflect.Method.invoke(Method.java:497)
    at org.apache.tools.ant.dispatch.DispatchUtils.execute(DispatchUtils.java:106)
    at org.apache.tools.ant.TaskAdapter.execute(TaskAdapter.java:154)
    at org.apache.tools.ant.UnknownElement.execute(UnknownElement.java:291)
    at sun.reflect.GeneratedMethodAccessor27.invoke(Unknown Source)
    at sun.reflect.DelegatingMethodAccessorImpl.invoke(DelegatingMethodAccessorImpl.java:43)
    at java.lang.reflect.Method.invoke(Method.java:497)
    at org.apache.tools.ant.dispatch.DispatchUtils.execute(DispatchUtils.java:106)
    at org.apache.tools.ant.Task.perform(Task.java:348)
    at org.apache.tools.ant.Target.execute(Target.java:392)
    at org.apache.tools.ant.Target.performTasks(Target.java:413)
    at org.apache.tools.ant.Project.executeSortedTargets(Project.java:1399)
    at org.apache.tools.ant.Project.executeTarget(Project.java:1368)
    at org.apache.tools.ant.helper.DefaultExecutor.executeTargets(DefaultExecutor.java:41)
    at org.apache.tools.ant.Project.executeTargets(Project.java:1251)
    at com.sencha.ant.AntScript.execute(AntScript.java:116)

    ... 22 more
    Caused by: /Users/aestevez/Documents/RTFD/.sencha/app/build-impl.xml:335: The following error occurred while executing this line:
    /Users/aestevez/Documents/RTFD/.sencha/app/slice-impl.xml:386: The following error occurred while executing this line:
    /Users/aestevez/Documents/RTFD/.sencha/app/slice-impl.xml:387: The following error occurred while executing this line:
    /Users/aestevez/Documents/RTFD/.sencha/app/slice-impl.xml:122: com.sencha.exceptions.ExBuild: Timed out waiting for sass build completion
    at org.apache.tools.ant.ProjectHelper.addLocationToBuildException(ProjectHelper.java:551)
    at org.apache.tools.ant.taskdefs.Ant.execute(Ant.java:444)
    at org.apache.tools.ant.taskdefs.CallTarget.execute(CallTarget.java:105)
    at com.sencha.ant.CallTask.execute(CallTask.java:137)
    at org.apache.tools.ant.UnknownElement.execute(UnknownElement.java:291)
    at sun.reflect.GeneratedMethodAccessor27.invoke(Unknown Source)
    at sun.reflect.DelegatingMethodAccessorImpl.invoke(DelegatingMethodAccessorImpl.java:43)
    at java.lang.reflect.Method.invoke(Method.java:497)
    at org.apache.tools.ant.dispatch.DispatchUtils.execute(DispatchUtils.java:106)
    at org.apache.tools.ant.Task.perform(Task.java:348)
    at org.apache.tools.ant.Target.execute(Target.java:392)
    at org.apache.tools.ant.Target.performTasks(Target.java:413)
    at org.apache.tools.ant.Project.executeSortedTargets(Project.java:1399)
    at org.apache.tools.ant.helper.SingleCheckExecutor.executeTargets(SingleCheckExecutor.java:38)
    at org.apache.tools.ant.Project.executeTargets(Project.java:1251)
    at org.apache.tools.ant.taskdefs.Ant.execute(Ant.java:442)
    ... 48 more
    Caused by: /Users/aestevez/Documents/RTFD/.sencha/app/slice-impl.xml:386: The following error occurred while executing this line:
    /Users/aestevez/Documents/RTFD/.sencha/app/slice-impl.xml:387: The following error occurred while executing this line:
    /Users/aestevez/Documents/RTFD/.sencha/app/slice-impl.xml:122: com.sencha.exceptions.ExBuild: Timed out waiting for sass build completion
    at org.apache.tools.ant.ProjectHelper.addLocationToBuildException(ProjectHelper.java:551)
    at org.apache.tools.ant.taskdefs.MacroInstance.execute(MacroInstance.java:401)
    at org.apache.tools.ant.UnknownElement.execute(UnknownElement.java:291)
    at sun.reflect.GeneratedMethodAccessor27.invoke(Unknown Source)
    at sun.reflect.DelegatingMethodAccessorImpl.invoke(DelegatingMethodAccessorImpl.java:43)
    at java.lang.reflect.Method.invoke(Method.java:497)
    at org.apache.tools.ant.dispatch.DispatchUtils.execute(DispatchUtils.java:106)
    at org.apache.tools.ant.Task.perform(Task.java:348)
    at org.apache.tools.ant.Target.execute(Target.java:392)
    at org.apache.tools.ant.Target.performTasks(Target.java:413)
    at org.apache.tools.ant.Project.executeSortedTargets(Project.java:1399)
    at org.apache.tools.ant.helper.SingleCheckExecutor.executeTargets(SingleCheckExecutor.java:38)
    at org.apache.tools.ant.Project.executeTargets(Project.java:1251)
    at org.apache.tools.ant.taskdefs.Ant.execute(Ant.java:442)
    ... 62 more
    Caused by: /Users/aestevez/Documents/RTFD/.sencha/app/slice-impl.xml:387: The following error occurred while executing this line:
    /Users/aestevez/Documents/RTFD/.sencha/app/slice-impl.xml:122: com.sencha.exceptions.ExBuild: Timed out waiting for sass build completion
    at org.apache.tools.ant.ProjectHelper.addLocationToBuildException(ProjectHelper.java:551)
    at org.apache.tools.ant.taskdefs.Ant.execute(Ant.java:444)
    at org.apache.tools.ant.taskdefs.CallTarget.execute(CallTarget.java:105)
    at com.sencha.ant.CallTask.execute(CallTask.java:137)
    at org.apache.tools.ant.UnknownElement.execute(UnknownElement.java:291)
    at sun.reflect.GeneratedMethodAccessor27.invoke(Unknown Source)
    at sun.reflect.DelegatingMethodAccessorImpl.invoke(DelegatingMethodAccessorImpl.java:43)
    at java.lang.reflect.Method.invoke(Method.java:497)
    at org.apache.tools.ant.dispatch.DispatchUtils.execute(DispatchUtils.java:106)
    at org.apache.tools.ant.Task.perform(Task.java:348)
    at org.apache.tools.ant.taskdefs.Sequential.execute(Sequential.java:68)
    at net.sf.antcontrib.logic.IfTask.execute(IfTask.java:197)
    at sun.reflect.GeneratedMethodAccessor58.invoke(Unknown Source)
    at sun.reflect.DelegatingMethodAccessorImpl.invoke(DelegatingMethodAccessorImpl.java:43)
    at java.lang.reflect.Method.invoke(Method.java:497)
    at org.apache.tools.ant.dispatch.DispatchUtils.execute(DispatchUtils.java:106)
    at org.apache.tools.ant.TaskAdapter.execute(TaskAdapter.java:154)
    at org.apache.tools.ant.UnknownElement.execute(UnknownElement.java:291)
    at sun.reflect.GeneratedMethodAccessor27.invoke(Unknown Source)
    at sun.reflect.DelegatingMethodAccessorImpl.invoke(DelegatingMethodAccessorImpl.java:43)
    at java.lang.reflect.Method.invoke(Method.java:497)
    at org.apache.tools.ant.dispatch.DispatchUtils.execute(DispatchUtils.java:106)
    at org.apache.tools.ant.Task.perform(Task.java:348)
    at org.apache.tools.ant.taskdefs.Sequential.execute(Sequential.java:68)
    at org.apache.tools.ant.UnknownElement.execute(UnknownElement.java:291)
    at sun.reflect.GeneratedMethodAccessor27.invoke(Unknown Source)
    at sun.reflect.DelegatingMethodAccessorImpl.invoke(DelegatingMethodAccessorImpl.java:43)
    at java.lang.reflect.Method.invoke(Method.java:497)
    at org.apache.tools.ant.dispatch.DispatchUtils.execute(DispatchUtils.java:106)
    at org.apache.tools.ant.Task.perform(Task.java:348)
    at org.apache.tools.ant.taskdefs.MacroInstance.execute(MacroInstance.java:398)
    ... 74 more

    Caused by: /Users/aestevez/Documents/RTFD/.sencha/app/slice-impl.xml:122: com.sencha.exceptions.ExBuild: Timed out waiting for sass build completion
    at org.apache.tools.ant.dispatch.DispatchUtils.execute(DispatchUtils.java:116)
    at org.apache.tools.ant.Task.perform(Task.java:348)
    at org.apache.tools.ant.taskdefs.Sequential.execute(Sequential.java:68)
    at net.sf.antcontrib.logic.IfTask.execute(IfTask.java:217)
    at sun.reflect.GeneratedMethodAccessor58.invoke(Unknown Source)
    at sun.reflect.DelegatingMethodAccessorImpl.invoke(DelegatingMethodAccessorImpl.java:43)
    at java.lang.reflect.Method.invoke(Method.java:497)
    at org.apache.tools.ant.dispatch.DispatchUtils.execute(DispatchUtils.java:106)
    at org.apache.tools.ant.TaskAdapter.execute(TaskAdapter.java:154)
    at org.apache.tools.ant.UnknownElement.execute(UnknownElement.java:291)
    at sun.reflect.GeneratedMethodAccessor27.invoke(Unknown Source)
    at sun.reflect.DelegatingMethodAccessorImpl.invoke(DelegatingMethodAccessorImpl.java:43)
    at java.lang.reflect.Method.invoke(Method.java:497)
    at org.apache.tools.ant.dispatch.DispatchUtils.execute(DispatchUtils.java:106)
    at org.apache.tools.ant.Task.perform(Task.java:348)
    at org.apache.tools.ant.taskdefs.Sequential.execute(Sequential.java:68)
    at net.sf.antcontrib.logic.IfTask.execute(IfTask.java:197)
    at sun.reflect.GeneratedMethodAccessor58.invoke(Unknown Source)
    at sun.reflect.DelegatingMethodAccessorImpl.invoke(DelegatingMethodAccessorImpl.java:43)
    at java.lang.reflect.Method.invoke(Method.java:497)
    at org.apache.tools.ant.dispatch.DispatchUtils.execute(DispatchUtils.java:106)
    at org.apache.tools.ant.TaskAdapter.execute(TaskAdapter.java:154)
    at org.apache.tools.ant.UnknownElement.execute(UnknownElement.java:291)
    at sun.reflect.GeneratedMethodAccessor27.invoke(Unknown Source)
    at sun.reflect.DelegatingMethodAccessorImpl.invoke(DelegatingMethodAccessorImpl.java:43)
    at java.lang.reflect.Method.invoke(Method.java:497)
    at org.apache.tools.ant.dispatch.DispatchUtils.execute(DispatchUtils.java:106)
    at org.apache.tools.ant.Task.perform(Task.java:348)
    at org.apache.tools.ant.Target.execute(Target.java:392)
    at org.apache.tools.ant.Target.performTasks(Target.java:413)
    at org.apache.tools.ant.Project.executeSortedTargets(Project.java:1399)
    at org.apache.tools.ant.helper.SingleCheckExecutor.executeTargets(SingleCheckExecutor.java:38)
    at org.apache.tools.ant.Project.executeTargets(Project.java:1251)
    at org.apache.tools.ant.taskdefs.Ant.execute(Ant.java:442)
    ... 103 more
    Caused by: com.sencha.exceptions.ExBuild: Timed out waiting for sass build completion
    at com.sencha.tools.sass.SassBuildCompletionListener.waitForComplete(SassBuildCompletionListener.java:61)
    at com.sencha.ant.SassBuildTask.runBuild(SassBuildTask.java:81)
    at com.sencha.ant.SassBuildTask.buildSass(SassBuildTask.java:64)
    at com.sencha.ant.SassBuildTask.doExecute(SassBuildTask.java:48)
    at com.sencha.ant.BaseAntTask.execute(BaseAntTask.java:34)
    at org.apache.tools.ant.UnknownElement.execute(UnknownElement.java:291)
    at sun.reflect.GeneratedMethodAccessor27.invoke(Unknown Source)
    at sun.reflect.DelegatingMethodAccessorImpl.invoke(DelegatingMethodAccessorImpl.java:43)
    at java.lang.reflect.Method.invoke(Method.java:497)
    at org.apache.tools.ant.dispatch.DispatchUtils.execute(DispatchUtils.java:106)
    ... 136 more

    11:34:08 AM
    rsync -arvuz "/Users/aestevez/Documents/RTFD/build/production/rtfd" "/Applications/MAMP/htdocs/RTFD-BUILD" --exclude .svn --exclude .git --exclude .hg --exclude .DS_Store --exclude .cvs --exclude metadata --exclude *.xds --exclude .xds --exclude .architect --exclude .sencha_backup --exclude archive --cvs-exclude
    rsync -arvuz /Users/aestevez/Documents/RTFD/build/production/rtfd /Applications/MAMP/htdocs/RTFD-BUILD --exclude .svn --exclude .git --exclude .hg --exclude .DS_Store --exclude .cvs --exclude metadata --exclude *.xds --exclude .xds --exclude .architect --exclude .sencha_backup --exclude archive --cvs-exclude

    building file list ... done

    rtfd/app.js

    rtfd/resources/.arch-internal-preview.css

    rtfd/resources/preview-theme-crisp-d6fd2884-dc10-451d-bad2-46eba59fc0cb.css


    sent 1211600 bytes received 86 bytes 2423372.00 bytes/sec
    total size is 17367926 speedup is 14.33

    rsync -arvuz /Users/aestevez/Documents/RTFD/build/production/rtfd /Applications/MAMP/htdocs/RTFD-BUILD --exclude .svn --exclude .git --exclude .hg --exclude .DS_Store --exclude .cvs --exclude metadata --exclude *.xds --exclude .xds --exclude .architect --exclude .sencha_backup --exclude archive --cvs-exclude
    building file list ... done
    rtfd/app.js
    rtfd/resources/.arch-internal-preview.css
    rtfd/resources/preview-theme-crisp-d6fd2884-dc10-451d-bad2-46eba59fc0cb.css
    sent 1211600 bytes received 86 bytes 2423372.00 bytes/sec
    total size is 17367926 speedup is 14.33

    How Can I fix it? thanks

  2. Hello

    Thank you for you report.
    This is known issue and the devs are working on a fix.

    There are some problems with Cmd 6.1.0.65 on OS X.

    Currently as a workaround you can tell Architect to use older Cmd 6.0.2.14.

    To set this particular version of Cmd, please follow these steps:

    By default CMD versions are installed to user's home bin subfolder, e.g. for user jack it is C:\Users\jack\bin\Sencha\Cmd. Inside this Cmd folder there are subfolders with particular CMD versions, e.g. 5.1.3.61 or 6.0.1.76. Architect use the latest (the highest) version found in this folder. If user would like to force Architect to use other version then it has settings for it: Edit ? Preferences ? Dependencies ? Custom Cmd Base Path. But user cannot set it to the one particular CMD version, e.g. to C:\Users\jack\bin\Sencha\Cmd\5.1.3.61. See the description in help icon aside the Custom Cmd Base Path input. User have to create new directory, e.g. C:\Users\jack\bin\Sencha\CmdArchitect and copy there one particular version of CMD together with the version folder, so the result path will be C:\Users\jack\bin\Sencha\CmdArchitect\5.1.3.61. The Architect setting of the Custom Cmd Base Path must be set to C:\Users\jack\bin\Sencha\CmdArchitect.


    Thank you
    Petr

  3. #2
    Sencha User
    Join Date
    Sep 2014
    Location
    Central Europe
    Posts
    795
    Answers
    103

    Default

    Hello

    Thank you for you report.
    This is known issue and the devs are working on a fix.

    There are some problems with Cmd 6.1.0.65 on OS X.

    Currently as a workaround you can tell Architect to use older Cmd 6.0.2.14.

    To set this particular version of Cmd, please follow these steps:

    By default CMD versions are installed to user's home bin subfolder, e.g. for user jack it is C:\Users\jack\bin\Sencha\Cmd. Inside this Cmd folder there are subfolders with particular CMD versions, e.g. 5.1.3.61 or 6.0.1.76. Architect use the latest (the highest) version found in this folder. If user would like to force Architect to use other version then it has settings for it: Edit ? Preferences ? Dependencies ? Custom Cmd Base Path. But user cannot set it to the one particular CMD version, e.g. to C:\Users\jack\bin\Sencha\Cmd\5.1.3.61. See the description in help icon aside the Custom Cmd Base Path input. User have to create new directory, e.g. C:\Users\jack\bin\Sencha\CmdArchitect and copy there one particular version of CMD together with the version folder, so the result path will be C:\Users\jack\bin\Sencha\CmdArchitect\5.1.3.61. The Architect setting of the Custom Cmd Base Path must be set to C:\Users\jack\bin\Sencha\CmdArchitect.


    Thank you
    Petr

  4. #3
    Ext JS Premium Member
    Join Date
    Aug 2009
    Location
    Sant cugat del Valles
    Posts
    30
    Answers
    1

    Default It doesnt work with 6.0.2.14 either

    I tried and same results with the /sass exception

    Is it normal to dont get the index.html as well?

    I will try to download 6.0.3.46 and see :-(

  5. #4
    Sencha User
    Join Date
    Sep 2014
    Location
    Central Europe
    Posts
    795
    Answers
    103

    Default

    Please try to set Cmd 6.0.2.14 and restart your computer. We are seeing that sometimes the bug from Cmd 6.1 can affect the older versions installed on the Computer too.

  6. #5
    Ext JS Premium Member
    Join Date
    Aug 2009
    Location
    Sant cugat del Valles
    Posts
    30
    Answers
    1

    Default 6.0.3.46 doesnt work either

    At this point i dont know what to do ...

  7. #6
    Sencha User
    Join Date
    Sep 2014
    Location
    Central Europe
    Posts
    795
    Answers
    103

    Default

    If it doesn't work even after restart. You should be able to run production build of the App outside of the Architect.

    Open terminal navigate to the folder with the project and run
    Code:
    sencha app build production
    If the command sencha is not found, you can execute it directly from file which should be located at
    /home/bin/Sencha/Cmd/xxx

  8. #7
    Ext JS Premium Member
    Join Date
    Aug 2009
    Location
    Sant cugat del Valles
    Posts
    30
    Answers
    1

    Default Im lost now

    Sorry

    I tried 100 times to remove the latest version , create new folders start new projects from scratch, reboot the device but as soon i click on save project architect always uses the latest version. It downloads every time

    When I try to do by cli this is the output
    Sencha Cmd v6.0.2.14
    [ERR] Cannot satisfy requirements for "ext"!
    [INF] The following versions are available:
    [INF] 5.0.0.970 ( ... compatible back to 4.0)
    [INF] 5.0.1.1255 ( ... compatible back to 4.0)
    [INF] 5.1.0.107 ( ... compatible back to 4.0)
    [INF] 5.1.1.451 ( ... compatible back to 4.0)
    [INF] 6.0.0.640 ( ... compatible back to 6.0.0)
    [ERR] The following versions cannot be satisfied:
    [ERR] root: [email protected] (No matches!)
    [ERR] Cannot resolve package requirements
    [ERR]
    The application was last modified by a newer version of Sencha Cmd (6.1.0.42)
    the current is 6.0.2.14.
    Please install a newer Sencha Cmd version compatible with 6.1.0.42.

    Its always using 6.1 I will disconnect from internet to avoid the update and see, ...

  9. #8
    Sencha User
    Join Date
    Sep 2014
    Location
    Central Europe
    Posts
    795
    Answers
    103

    Default

    I am sorry, I have forgot that your Architect installation was probably shipped with Cmd 6.1.0.42 - with this version the issue still occurs? Even when you restart your computer / run from command line ?

    https://www.sencha.com/forum/showthr...5-Sass-Timeout
    The users reports in the Cmd forums that 6.0.2 works fine. If the 6.1.0.42 really doesn't work you can block SA from installing it.

    Finder -> Applications -> SenchaArchitect.app -> RightClick Show Package Contents -> Contents -> Resources -> Assets -> remove Cmd folder

    But there might be some communication issues between Cmd 6.0.2 and Architect 3.5

    Anyway - Architect 3.5 GA should be released soon and this bug will be fixed.

    Petr

Similar Threads

  1. Compile a project from cmd
    By ivalladares in forum Sencha Cmd
    Replies: 6
    Last Post: 25 Mar 2015, 3:42 AM
  2. Getting a simple GWT project to compile
    By ypfamily in forum Ext GWT: Discussion
    Replies: 1
    Last Post: 21 Jul 2009, 1:38 PM
  3. Compile Project to .war - Tomcat5.5
    By Michi_de in forum Community Discussion
    Replies: 6
    Last Post: 11 Dec 2008, 6:58 AM

Posting Permissions

  • You may not post new threads
  • You may not post replies
  • You may not post attachments
  • You may not edit your posts
  •