Page 1 of 2 12 LastLast
Results 1 to 10 of 17

Thread: Help! Can't build ExtJS 6.2 app after upgrading to 6.5

  1. #1
    Sencha Premium User tlloyduk's Avatar
    Join Date
    Sep 2010
    Posts
    91

    Exclamation Help! Can't build ExtJS 6.2 app after upgrading to 6.5

    Hi there,

    I had an Ext JS 6.2 classic app and I've upgraded to Sencha Cmd 6.5.0.180 and upgraded the framework with: sencha app upgrade path/to/ext6.5.0:

    Code:
    >sencha app upgrade ../ext-6.5.0Sencha Cmd v6.5.0.180
    [INF] Upgrading framework ext
    [INF] Copying framework to C:\wamp\www\ussportal\ext
    
    [INF] Framework 'ext' upgraded
    sencha -v on the command line shows: Sencha Cmd v6.5.0.180

    I can no longer build my classic app and instead a build fails almost immediately with:

    Code:
    >sencha app build --clean development
    Sencha Cmd v6.5.0.180
    [INF] Processing Build Descriptor : default (development environment)
    [INF] Loading compiler context
    [ERR]
    [ERR] BUILD FAILED
    [ERR] com.sencha.exceptions.BasicException: java.lang.NullPointerException
    [ERR]
    [ERR] Total time: 1 second
    [ERR] The following error occurred while executing this line:
    C:\Users\Tim Lloyd\bin\Sencha\Cmd\6.5.0.180\ant\build\app\build-impl.xml:387: The following error occurred while executing this line:
    C:\Users\Tim Lloyd\bin\Sencha\Cmd\6.5.0.180\ant\build\app\init-impl.xml:408: com.sencha.exceptions.BasicException: java.lang.NullPointerException
    I have also tried upgrading via Sencha Architect 4.2 and I get a more verbose error log. Pretty much at a loss here as I can't seem to find any other instructions for migrating to 6.5.

    Code:
    [INF] Processing Build Descriptor : default (testing environment)
    [INF] Loading compiler context
    [ERR]
    [ERR] BUILD FAILED
    [ERR] com.sencha.exceptions.BasicException: java.lang.NullPointerException
    [ERR]
    [ERR] Total time: 0 seconds
    Exception in thread "Thread-152" com.sencha.exceptions.BasicException: com.sencha.exceptions.BasicException: The following error occurred while executing this line:
    C:\wamp\www\ussportal\.sencha\app\build-impl.xml:386: The following error occurred while executing this line:
    C:\wamp\www\ussportal\.sencha\app\init-impl.xml:408: com.sencha.exceptions.BasicException: java.lang.NullPointerException
    at com.sencha.tools.server.service.tasks.DispatchTask.execute(DispatchTask.java:55)
    at com.sencha.tools.server.service.tasks.BaseServiceTask$1.run(BaseServiceTask.java:42)
    at com.sencha.util.ThreadUtil$1.run(ThreadUtil.java:65)
    at com.sencha.util.ThreadUtil$2.run(ThreadUtil.java:162)
    at java.lang.Thread.run(Unknown Source)
    Caused by: com.sencha.exceptions.BasicException: The following error occurred while executing this line:
    C:\wamp\www\ussportal\.sencha\app\build-impl.xml:386: The following error occurred while executing this line:
    C:\wamp\www\ussportal\.sencha\app\init-impl.xml:408: com.sencha.exceptions.BasicException: java.lang.NullPointerException
    at com.sencha.exceptions.BasicException.wrap(BasicException.java:54)
    at com.sencha.ant.AntScript.execute(AntScript.java:120)
    at com.sencha.command.plugin.PluginManager.execute(PluginManager.java:104)
    at com.sencha.command.plugin.PluginManager.executeReverseFirst(PluginManager.java:145)
    at com.sencha.command.environment.BuildEnvironment.execute(BuildEnvironment.java:306)
    at com.sencha.command.environment.AppOrPackageEnvironment.execute(AppOrPackageEnvironment.java:712)
    at com.sencha.command.BasePluginCommands$BasePluginCommand.doExecute(BasePluginCommands.java:125)
    at com.sencha.command.app.AppCommands$BuildCommand.execute(AppCommands.java:470)
    at sun.reflect.NativeMethodAccessorImpl.invoke0(Native Method)
    at sun.reflect.NativeMethodAccessorImpl.invoke(Unknown Source)
    at sun.reflect.DelegatingMethodAccessorImpl.invoke(Unknown Source)
    at java.lang.reflect.Method.invoke(Unknown Source)
    at com.sencha.util.MethodInvoker$Arguments.invoke(MethodInvoker.java:175)
    at com.sencha.cli.Command.dispatch(Command.java:43)
    at com.sencha.command.BasePluginCommands$BasePluginCommand.dispatch(BasePluginCommands.java:289)
    at com.sencha.cli.Commands.dispatch(Commands.java:64)
    at com.sencha.cli.Commands.dispatch(Commands.java:64)
    at com.sencha.command.Sencha.dispatch(Sencha.java:79)
    at com.sencha.cli.AbstractCommand.dispatch(AbstractCommand.java:124)
    at com.sencha.tools.server.service.tasks.DispatchTask.execute(DispatchTask.java:52)
    ... 4 more
    Caused by: C:\Users\Tim Lloyd\bin\Sencha\Architect\Cmd\6.5.0.180\plugin.xml:333: The following error occurred while executing this line:
    C:\wamp\www\ussportal\.sencha\app\build-impl.xml:386: The following error occurred while executing this line:
    C:\wamp\www\ussportal\.sencha\app\init-impl.xml:408: com.sencha.exceptions.BasicException: java.lang.NullPointerException
    at org.apache.tools.ant.ProjectHelper.addLocationToBuildException(ProjectHelper.java:551)
    at org.apache.tools.ant.taskdefs.Ant.execute(Ant.java:444)
    at org.apache.tools.ant.UnknownElement.execute(UnknownElement.java:291)
    at sun.reflect.GeneratedMethodAccessor32.invoke(Unknown Source)
    at sun.reflect.DelegatingMethodAccessorImpl.invoke(Unknown Source)
    at java.lang.reflect.Method.invoke(Unknown Source)
    at org.apache.tools.ant.dispatch.DispatchUtils.execute(DispatchUtils.java:106)
     
    at org.apache.tools.ant.Task.perform(Task.java:348)
    at org.apache.tools.ant.taskdefs.Sequential.execute(Sequential.java:68)
    at net.sf.antcontrib.logic.IfTask.execute(IfTask.java:217)
    at sun.reflect.GeneratedMethodAccessor44.invoke(Unknown Source)
    at sun.reflect.DelegatingMethodAccessorImpl.invoke(Unknown Source)
    at java.lang.reflect.Method.invoke(Unknown Source)
    at org.apache.tools.ant.dispatch.DispatchUtils.execute(DispatchUtils.java:106)
    at org.apache.tools.ant.TaskAdapter.execute(TaskAdapter.java:154)
    at org.apache.tools.ant.UnknownElement.execute(UnknownElement.java:291)
    at sun.reflect.GeneratedMethodAccessor32.invoke(Unknown Source)
    at sun.reflect.DelegatingMethodAccessorImpl.invoke(Unknown Source)
    at java.lang.reflect.Method.invoke(Unknown Source)
    at org.apache.tools.ant.dispatch.DispatchUtils.execute(DispatchUtils.java:106)
    at org.apache.tools.ant.Task.perform(Task.java:348)
    at org.apache.tools.ant.Target.execute(Target.java:392)
    at org.apache.tools.ant.Target.performTasks(Target.java:413)
    at org.apache.tools.ant.Project.executeSortedTargets(Project.java:1399)
    at org.apache.tools.ant.Project.executeTarget(Project.java:1368)
    at org.apache.tools.ant.helper.DefaultExecutor.executeTargets(DefaultExecutor.java:41)
    at org.apache.tools.ant.Project.executeTargets(Project.java:1251)
    at com.sencha.ant.AntScript.execute(AntScript.java:116)
    ... 22 more
    Caused by: C:\wamp\www\ussportal\.sencha\app\build-impl.xml:386: The following error occurred while executing this line:
    C:\wamp\www\ussportal\.sencha\app\init-impl.xml:408: com.sencha.exceptions.BasicException: java.lang.NullPointerException
    at org.apache.tools.ant.ProjectHelper.addLocationToBuildException(ProjectHelper.java:551)
    at org.apache.tools.ant.taskdefs.Ant.execute(Ant.java:444)
    at org.apache.tools.ant.taskdefs.CallTarget.execute(CallTarget.java:105)
    at com.sencha.ant.CallTask.execute(CallTask.java:137)
    at org.apache.tools.ant.UnknownElement.execute(UnknownElement.java:291)
    at sun.reflect.GeneratedMethodAccessor32.invoke(Unknown Source)
    at sun.reflect.DelegatingMethodAccessorImpl.invoke(Unknown Source)
    at java.lang.reflect.Method.invoke(Unknown Source)
    at org.apache.tools.ant.dispatch.DispatchUtils.execute(DispatchUtils.java:106)
     
    at org.apache.tools.ant.Task.perform(Task.java:348)
    at org.apache.tools.ant.Target.execute(Target.java:392)
    at org.apache.tools.ant.Target.performTasks(Target.java:413)
    at org.apache.tools.ant.Project.executeSortedTargets(Project.java:1399)
    at org.apache.tools.ant.helper.SingleCheckExecutor.executeTargets(SingleCheckExecutor.java:38)
    at org.apache.tools.ant.Project.executeTargets(Project.java:1251)
    at org.apache.tools.ant.taskdefs.Ant.execute(Ant.java:442)
    ... 48 more
    Caused by: C:\wamp\www\ussportal\.sencha\app\init-impl.xml:408: com.sencha.exceptions.BasicException: java.lang.NullPointerException
    at org.apache.tools.ant.dispatch.DispatchUtils.execute(DispatchUtils.java:116)
    at org.apache.tools.ant.Task.perform(Task.java:348)
    at org.apache.tools.ant.Target.execute(Target.java:392)
    at org.apache.tools.ant.Target.performTasks(Target.java:413)
    at org.apache.tools.ant.Project.executeSortedTargets(Project.java:1399)
    at org.apache.tools.ant.helper.SingleCheckExecutor.executeTargets(SingleCheckExecutor.java:38)
    at org.apache.tools.ant.Project.executeTargets(Project.java:1251)
    at org.apache.tools.ant.taskdefs.Ant.execute(Ant.java:442)
    ... 62 more
    Caused by: com.sencha.exceptions.BasicException: java.lang.NullPointerException
    at com.sencha.cli.AbstractCommand$Property.set(AbstractCommand.java:408)
    at com.sencha.cli.AbstractCommand.processConfigParam(AbstractCommand.java:530)
    at com.sencha.cli.AbstractCommand.configure(AbstractCommand.java:114)
    at com.sencha.cli.Command.dispatch(Command.java:32)
    at com.sencha.cli.Commands.dispatch(Commands.java:64)
    at com.sencha.command.compile.CompileCommands.dispatch(CompileCommands.java:331)
    at com.sencha.cli.AbstractCommand.dispatch(AbstractCommand.java:124)
    at com.sencha.ant.CompileTask$CompileToken.initialize(CompileTask.java:156)
     
    at com.sencha.ant.CompileTask$CompileToken.dispatchCommand(CompileTask.java:163)
    at com.sencha.ant.CompileTask.doExecute(CompileTask.java:123)
    at com.sencha.ant.BaseAntTask.execute(BaseAntTask.java:34)
    at com.sencha.ant.CompileTask.execute(CompileTask.java:36)
    at org.apache.tools.ant.UnknownElement.execute(UnknownElement.java:291)
    at sun.reflect.GeneratedMethodAccessor32.invoke(Unknown Source)
    at sun.reflect.DelegatingMethodAccessorImpl.invoke(Unknown Source)
    at java.lang.reflect.Method.invoke(Unknown Source)
    at org.apache.tools.ant.dispatch.DispatchUtils.execute(DispatchUtils.java:106)
    ... 69 more
    Caused by: java.lang.NullPointerException
    at com.sencha.command.environment.AppOrPackageEnvironment.collectPackageNames(AppOrPackageEnvironment.java:304)
     
    at com.sencha.command.environment.AppOrPackageEnvironment.getBasePackages(AppOrPackageEnvironment.java:347)
    at com.sencha.command.environment.AppOrPackageEnvironment.getBasePackages(AppOrPackageEnvironment.java:340)
    at com.sencha.command.environment.AppOrPackageEnvironment.getRequiredPackagesNoBases(AppOrPackageEnvironment.java:262)
    at com.sencha.command.environment.AppEnvironment.getPageModel(AppEnvironment.java:251)
    at com.sencha.command.environment.AppEnvironment.getPageModel(AppEnvironment.java:236)
    at com.sencha.tools.page.AppJsonBuilder.(AppJsonBuilder.java:42)
    at com.sencha.command.compile.app.BaseAppCompileCommand.getAppJsonBuilder(BaseAppCompileCommand.java:26)
    at com.sencha.command.compile.app.BaseAppCompileCommand.getAppJsonBuilder(BaseAppCompileCommand.java:18)
    at com.sencha.command.compile.app.LoadAppCommand.setFrameworkFileName(LoadAppCommand.java:44)
    at sun.reflect.NativeMethodAccessorImpl.invoke0(Native Method)
    at sun.reflect.NativeMethodAccessorImpl.invoke(Unknown Source)
    at sun.reflect.DelegatingMethodAccessorImpl.invoke(Unknown Source)
    at java.lang.reflect.Method.invoke(Unknown Source)
    at com.sencha.cli.AbstractCommand$Property.set(AbstractCommand.java:396)
    ... 85 more
    Any help appreciated

    Thanks

  2. #2
    Sencha Premium User tlloyduk's Avatar
    Join Date
    Sep 2010
    Posts
    91

    Default

    OK made a little bit of progress, if I remove the reference to my custom theme (made with Sencha Themer) then it will now build as expected. Now to figure out how to use the custom theme with 6.5.... any thoughts ?

  3. #3
    Sencha Premium User tlloyduk's Avatar
    Join Date
    Sep 2010
    Posts
    91

    Default

    I updated to Themer 1.2, removed the theme from my project and re-added it. I also tried exporting it as a zip from Themer and adding it again but it always results in the following.

    Any thoughts ?

    Code:
    [INF] Loading compiler context[ERR]
    [ERR] BUILD FAILED
    [ERR] com.sencha.exceptions.BasicException: java.lang.NullPointerException
    [ERR]
    [ERR] Total time: 0 seconds
    Exception in thread "Thread-113" com.sencha.exceptions.BasicException: com.sencha.exceptions.BasicException: The following error occurred while executing this line:
    C:\wamp\www\ussportal\.sencha\app\init-impl.xml:408: com.sencha.exceptions.BasicException: java.lang.NullPointerException
    at com.sencha.tools.server.service.tasks.DispatchTask.execute(DispatchTask.java:55)
    at com.sencha.tools.server.service.tasks.BaseServiceTask$1.run(BaseServiceTask.java:42)
    at com.sencha.util.ThreadUtil$1.run(ThreadUtil.java:65)
    at com.sencha.util.ThreadUtil$2.run(ThreadUtil.java:162)
    at java.lang.Thread.run(Unknown Source)
    Caused by: com.sencha.exceptions.BasicException: The following error occurred while executing this line:
    C:\wamp\www\ussportal\.sencha\app\init-impl.xml:408: com.sencha.exceptions.BasicException: java.lang.NullPointerException
    at com.sencha.exceptions.BasicException.wrap(BasicException.java:54)
    at com.sencha.ant.AntScript.execute(AntScript.java:120)
    at com.sencha.ant.AntScript.execute(AntScript.java:128)
    at com.sencha.command.ant.AntCommand.execute(AntCommand.java:120)
    at sun.reflect.NativeMethodAccessorImpl.invoke0(Native Method)
    at sun.reflect.NativeMethodAccessorImpl.invoke(Unknown Source)
    at sun.reflect.DelegatingMethodAccessorImpl.invoke(Unknown Source)
    at java.lang.reflect.Method.invoke(Unknown Source)
    at com.sencha.util.MethodInvoker$Arguments.invoke(MethodInvoker.java:175)
    at com.sencha.cli.Command.dispatch(Command.java:43)
    at com.sencha.cli.Commands.dispatch(Commands.java:64)
    at com.sencha.command.Sencha.dispatch(Sencha.java:79)
    at com.sencha.cli.AbstractCommand.dispatch(AbstractCommand.java:124)
    at com.sencha.tools.server.service.tasks.DispatchTask.execute(DispatchTask.java:52)
    ... 4 more
    Caused by: C:\wamp\www\ussportal\.sencha\app\build-impl.xml:291: The following error occurred while executing this line:
    C:\wamp\www\ussportal\.sencha\app\init-impl.xml:408: com.sencha.exceptions.BasicException: java.lang.NullPointerException
    at org.apache.tools.ant.ProjectHelper.addLocationToBuildException(ProjectHelper.java:551)
    at org.apache.tools.ant.taskdefs.Ant.execute(Ant.java:444)
    at org.apache.tools.ant.taskdefs.CallTarget.execute(CallTarget.java:105)
    at com.sencha.ant.CallTask.execute(CallTask.java:137)
    at org.apache.tools.ant.UnknownElement.execute(UnknownElement.java:291)
    at sun.reflect.GeneratedMethodAccessor26.invoke(Unknown Source)
    at sun.reflect.DelegatingMethodAccessorImpl.invoke(Unknown Source)
    at java.lang.reflect.Method.invoke(Unknown Source)
    at org.apache.tools.ant.dispatch.DispatchUtils.execute(DispatchUtils.java:106)
    at org.apache.tools.ant.Task.perform(Task.java:348)
    at org.apache.tools.ant.Target.execute(Target.java:392)
    at org.apache.tools.ant.Target.performTasks(Target.java:413)
    at org.apache.tools.ant.Project.executeSortedTargets(Project.java:1399)
    at org.apache.tools.ant.Project.executeTarget(Project.java:1368)
    at org.apache.tools.ant.helper.DefaultExecutor.executeTargets(DefaultExecutor.java:41)
    at org.apache.tools.ant.Project.executeTargets(Project.java:1251)
    at com.sencha.ant.AntScript.execute(AntScript.java:116)
    ... 16 more
    Caused by: C:\wamp\www\ussportal\.sencha\app\init-impl.xml:408: com.sencha.exceptions.BasicException: java.lang.NullPointerException
    at org.apache.tools.ant.dispatch.DispatchUtils.execute(DispatchUtils.java:116)
    at org.apache.tools.ant.Task.perform(Task.java:348)
    at org.apache.tools.ant.Target.execute(Target.java:392)
    at org.apache.tools.ant.Target.performTasks(Target.java:413)
    at org.apache.tools.ant.Project.executeSortedTargets(Project.java:1399)
    at org.apache.tools.ant.helper.SingleCheckExecutor.executeTargets(SingleCheckExecutor.java:38)
    at org.apache.tools.ant.Project.executeTargets(Project.java:1251)
    at org.apache.tools.ant.taskdefs.Ant.execute(Ant.java:442)
    ... 31 more
    Caused by: com.sencha.exceptions.BasicException: java.lang.NullPointerException
    at com.sencha.cli.AbstractCommand$Property.set(AbstractCommand.java:408)
    at com.sencha.cli.AbstractCommand.processConfigParam(AbstractCommand.java:530)
    at com.sencha.cli.AbstractCommand.configure(AbstractCommand.java:114)
    at com.sencha.cli.Command.dispatch(Command.java:32)
    at com.sencha.cli.Commands.dispatch(Commands.java:64)
    at com.sencha.command.compile.CompileCommands.dispatch(CompileCommands.java:331)
    at com.sencha.cli.AbstractCommand.dispatch(AbstractCommand.java:124)
    at com.sencha.ant.CompileTask$CompileToken.initialize(CompileTask.java:156)
    at com.sencha.ant.CompileTask$CompileToken.dispatchCommand(CompileTask.java:163)
    at com.sencha.ant.CompileTask.doExecute(CompileTask.java:123)
    at com.sencha.ant.BaseAntTask.execute(BaseAntTask.java:34)
    at com.sencha.ant.CompileTask.execute(CompileTask.java:36)
    at org.apache.tools.ant.UnknownElement.execute(UnknownElement.java:291)
    at sun.reflect.GeneratedMethodAccessor26.invoke(Unknown Source)
    at sun.reflect.DelegatingMethodAccessorImpl.invoke(Unknown Source)
    at java.lang.reflect.Method.invoke(Unknown Source)
    at org.apache.tools.ant.dispatch.DispatchUtils.execute(DispatchUtils.java:106)
    ... 38 more
    Caused by: java.lang.NullPointerException
    at com.sencha.command.environment.AppOrPackageEnvironment.collectPackageNames(AppOrPackageEnvironment.java:304)
    at com.sencha.command.environment.AppOrPackageEnvironment.getBasePackages(AppOrPackageEnvironment.java:347)
    at com.sencha.command.environment.AppOrPackageEnvironment.getBasePackages(AppOrPackageEnvironment.java:340)
    at com.sencha.command.environment.AppOrPackageEnvironment.getRequiredPackagesNoBases(AppOrPackageEnvironment.java:262)
    at com.sencha.command.environment.AppEnvironment.getPageModel(AppEnvironment.java:251)
    at com.sencha.command.environment.AppEnvironment.getPageModel(AppEnvironment.java:236)
    at com.sencha.tools.page.AppJsonBuilder.(AppJsonBuilder.java:42)
    at com.sencha.command.compile.app.BaseAppCompileCommand.getAppJsonBuilder(BaseAppCompileCommand.java:26)
    at com.sencha.command.compile.app.BaseAppCompileCommand.getAppJsonBuilder(BaseAppCompileCommand.java:18)
    at com.sencha.command.compile.app.LoadAppCommand.setFrameworkFileName(LoadAppCommand.java:44)
    at sun.reflect.NativeMethodAccessorImpl.invoke0(Native Method)
    at sun.reflect.NativeMethodAccessorImpl.invoke(Unknown Source)
    at sun.reflect.DelegatingMethodAccessorImpl.invoke(Unknown Source)
    at java.lang.reflect.Method.invoke(Unknown Source)
    at com.sencha.cli.AbstractCommand$Property.set(AbstractCommand.java:396)
    ... 54 more

  4. #4
    Sencha Premium User tlloyduk's Avatar
    Join Date
    Sep 2010
    Posts
    91

    Default

    Final update - I created a new theme in Themer 1.2 and imported that into my 6.5 project and it is now building without errors. Shame I've not been able to carry over my old theme but at least I'm back up and running

  5. #5
    Sencha Premium Member
    Join Date
    Jan 2015
    Posts
    17

    Default

    Quote Originally Posted by tlloyduk View Post
    Final update - I created a new theme in Themer 1.2 and imported that into my 6.5 project and it is now building without errors. Shame I've not been able to carry over my old theme but at least I'm back up and running
    Hi tlloyduk,
    Thank you for your feedback.
    I have the same Problem. How exactly have you created a new Theme and imported this to your App?

    Thank You.

  6. #6
    Sencha Premium User tlloyduk's Avatar
    Join Date
    Sep 2010
    Posts
    91

    Default

    Hi Mathew

    Actually someone on the Slack group suggested you can use:

    Code:
    sencha package upgrade
    sencha package build
    (https://docs.sencha.com/cmd/guides/a...ackage_upgrade)

    .....to fix the theme. I had already recreated a new one but perhaps you'd want to try this first.

    Creating a new one was a case of upgrading the framework version for the project first, then going in to Themer and creating a new theme. Publish the theme to a new folder and then import it (Architect or app.json)

  7. #7
    Sencha Premium Member
    Join Date
    Jan 2015
    Posts
    17

    Default

    Hi tlloyduk,

    Thank you for your Answer!

    I have tried both tips but had no success.

    1. There is an error after the command: "sencha package build":
    1.JPG

    2.
    - I have Created a new theme with Theamer
    - exported this as zip file
    - unpacked the folder to /packaged/local
    - changed the theme property in app.js

    After "sencha app build" or "sencha app refresh" i get this error:
    2.jpg


    Any help appreciated

    Thanks

  8. #8
    Sencha User
    Join Date
    Oct 2016
    Posts
    11

    Default

    I am also having the same problem and getting the same error. I did exactly what Mathew did with the same results along with doing the sencha package upgrade and sencha package build (same error when doing either a sencha app build or refresh.

    Any more ideas to try on this and is there something else in the app.json that needs to change besides the "theme" name?

    Thanks

  9. #9
    Sencha Premium User tlloyduk's Avatar
    Join Date
    Sep 2010
    Posts
    91

    Default

    Does your project build if you remove your custom theme ?

  10. #10
    Sencha User
    Join Date
    Oct 2016
    Posts
    11

    Default

    Yes it does

Page 1 of 2 12 LastLast

Similar Threads

  1. Replies: 14
    Last Post: 13 Nov 2013, 11:18 AM
  2. Upgrading packages of apps when upgrading CMD/ExtJS
    By anton.dimitrov in forum Sencha Cmd
    Replies: 3
    Last Post: 30 Oct 2013, 5:31 AM
  3. Replies: 9
    Last Post: 23 Oct 2013, 2:09 PM
  4. [CLOSED] Problem upgrading ST app using Cmd build 181
    By parky128 in forum Sencha Cmd
    Replies: 3
    Last Post: 4 Oct 2012, 11:55 AM

Posting Permissions

  • You may not post new threads
  • You may not post replies
  • You may not post attachments
  • You may not edit your posts
  •